{"text_format":"1","workbook":"xlsx","n_sheets":3,"sheets":["Names List","Variable","Matched Names"],"not_rendered":{"charts":0,"images":0,"macros":1,"external_links":0,"defined_names":4,"comments":0,"pivot_tables":0},"unopened":[],"bounds":{"document_bytes":16777216,"sheet_cells":100000,"rows_first":2000,"rows_last":500,"rows_between":2000,"halvings":0,"cell_chars":16384,"cell_head_chars":4096},"cells_cut":0,"cells_raw":0,"read":"whole","date_system":"1900"}

{"sheet":"Names List","index":0,"n_rows":5,"n_cols":6,"rows_kept":5,"cut":false,"hidden":false,"merged":[]}
["Name","E-mail","Site","Location/Team/Ward","Time-Stamp","First Name"]
["John Smith","john.smith@nhs.net","Site X","Ward 1","2019-10-15T10:00:00",{"$f":"LEFT(CoffeeBeans[Name],SEARCH(\" \",CoffeeBeans[Name]))","v":"John "}]
["Steve Jones","Steve.jones@nhs.net","Site X","Ward 8","2019-10-15T11:13:00",{"$f":"LEFT(CoffeeBeans[Name],SEARCH(\" \",CoffeeBeans[Name]))","v":"Steve "}]
["Jane Samuels","jane.samuels@nhs.net","Site Y","Children's Ward","2019-10-15T11:27:00",{"$f":"LEFT(CoffeeBeans[Name],SEARCH(\" \",CoffeeBeans[Name]))","v":"Jane "}]
["Sue Jackson","susan.jackson@nhs.net","Site Y","HR Team ","2019-10-15T11:28:00",{"$f":"LEFT(CoffeeBeans[Name],SEARCH(\" \",CoffeeBeans[Name]))","v":"Sue "}]

{"sheet":"Variable","index":1,"n_rows":303,"n_cols":16,"rows_kept":303,"cut":false,"hidden":false,"merged":[]}
[null,"Number","Name",null,null,"Pair","Person 1","Person 2","Site 1","Site 2","Dept 1","Dept 2","First Name 1","First Name 2","e-mail 1","email 2"]
[{"$f":"IF(ISBLANK(C2),\"\",RAND())","v":0.77919580372439479},{"$f":"IFERROR(_xlfn.RANK.AVG(A2,$A$2:$A$1001,0),\"\")","v":2},"John Smith",{"$f":"IF(ISNUMBER(A2),COUNTIF(G:G,C2)+COUNTIF(H:H,C2),\"\")","v":1},"Particpant Count",{"$f":"IF(F1=\"Pair\",1,IF(ISNUMBER(F1),IF(F1+1>$E$3/2,\"\",F1+1),\"\"))","v":1},{"$f":"IF(ISNUMBER(F2),VLOOKUP(F2,Participants2,2,FALSE),\"\")","v":"Jane Samuels"},{"$f":"IF(ISNUMBER(F2),VLOOKUP($E$3+1-F2,Participants2,2,FALSE),\"\")","v":"Sue Jackson"},{"$f":"IFERROR(VLOOKUP(G2,CoffeeBeans[],3,FALSE),\"\")","v":"Site Y"},{"$f":"IFERROR(VLOOKUP(H2,CoffeeBeans[],3,FALSE),\"\")","v":"Site Y"},{"$f":"IFERROR(VLOOKUP(G2,CoffeeBeans[],4,FALSE),\"\")","v":"Children's Ward"},{"$f":"IFERROR(VLOOKUP(H2,CoffeeBeans[],4,FALSE),\"\")","v":"HR Team "},{"$f":"IFERROR(VLOOKUP(G2,CoffeeBeans[],6,FALSE),\"\")","v":"Jane "},{"$f":"IFERROR(VLOOKUP(H2,CoffeeBeans[],6,FALSE),\"\")","v":"Sue "},{"$f":"IFERROR(VLOOKUP(G2,CoffeeBeans[],2,FALSE),\"\")","v":"jane.samuels@nhs.net"},{"$f":"IFERROR(VLOOKUP(H2,CoffeeBeans[],2,FALSE),\"\")","v":"susan.jackson@nhs.net"}]
[{"$f":"IF(ISBLANK(C3),\"\",RAND())","v":0.48997341334927613},{"$f":"IFERROR(_xlfn.RANK.AVG(A3,$A$2:$A$1001,0),\"\")","v":3},"Steve Jones",1,{"$f":"COUNT(A:A)","v":4},2,"John Smith","Steve Jones",{"$f":"IFERROR(VLOOKUP(G3,CoffeeBeans[],3,FALSE),\"\")","v":"Site X"},{"$f":"IFERROR(VLOOKUP(H3,CoffeeBeans[],3,FALSE),\"\")","v":"Site X"},{"$f":"IFERROR(VLOOKUP(G3,CoffeeBeans[],4,FALSE),\"\")","v":"Ward 1"},{"$f":"IFERROR(VLOOKUP(H3,CoffeeBeans[],4,FALSE),\"\")","v":"Ward 8"},{"$f":"IFERROR(VLOOKUP(G3,CoffeeBeans[],6,FALSE),\"\")","v":"John "},{"$f":"IFERROR(VLOOKUP(H3,CoffeeBeans[],6,FALSE),\"\")","v":"Steve "},{"$f":"IFERROR(VLOOKUP(G3,CoffeeBeans[],2,FALSE),\"\")","v":"john.smith@nhs.net"},{"$f":"IFERROR(VLOOKUP(H3,CoffeeBeans[],2,FALSE),\"\")","v":"Steve.jones@nhs.net"}]
[0.82844497114656324,1,"Jane Samuels",1,null,"","","",{"$f":"IFERROR(VLOOKUP(G4,CoffeeBeans[],3,FALSE),\"\")","v":""},{"$f":"IFERROR(VLOOKUP(H4,CoffeeBeans[],3,FALSE),\"\")","v":""},{"$f":"IFERROR(VLOOKUP(G4,CoffeeBeans[],4,FALSE),\"\")","v":""},{"$f":"IFERROR(VLOOKUP(H4,CoffeeBeans[],4,FALSE),\"\")","v":""},{"$f":"IFERROR(VLOOKUP(G4,CoffeeBeans[],6,FALSE),\"\")","v":""},{"$f":"IFERROR(VLOOKUP(H4,CoffeeBeans[],6,FALSE),\"\")","v":""},{"$f":"IFERROR(VLOOKUP(G4,CoffeeBeans[],2,FALSE),\"\")","v":""},{"$f":"IFERROR(VLOOKUP(H4,CoffeeBeans[],2,FALSE),\"\")","v":""}]
[0.14609380518432835,4,"Sue Jackson",1,"Number of Pairs","","","",{"$f":"IFERROR(VLOOKUP(G5,CoffeeBeans[],3,FALSE),\"\")","v":""},{"$f":"IFERROR(VLOOKUP(H5,CoffeeBeans[],3,FALSE),\"\")","v":""},{"$f":"IFERROR(VLOOKUP(G5,CoffeeBeans[],4,FALSE),\"\")","v":""},{"$f":"IFERROR(VLOOKUP(H5,CoffeeBeans[],4,FALSE),\"\")","v":""},{"$f":"IFERROR(VLOOKUP(G5,CoffeeBeans[],6,FALSE),\"\")","v":""},{"$f":"IFERROR(VLOOKUP(H5,CoffeeBeans[],6,FALSE),\"\")","v":""},{"$f":"IFERROR(VLOOKUP(G5,CoffeeBeans[],2,FALSE),\"\")","v":""},{"$f":"IFERROR(VLOOKUP(H5,CoffeeBeans[],2,FALSE),\"\")","v":""}]
["","",null,"",{"$f":"ROUNDDOWN(E3/2,0)","v":2},"","","",{"$f":"IFERROR(VLOOKUP(G6,CoffeeBeans[],3,FALSE),\"\")","v":""},{"$f":"IFERROR(VLOOKUP(H6,CoffeeBeans[],3,FALSE),\"\")","v":""},{"$f":"IFERROR(VLOOKUP(G6,CoffeeBeans[],4,FALSE),\"\")","v":""},{"$f":"IFERROR(VLOOKUP(H6,CoffeeBeans[],4,FALSE),\"\")","v":""},{"$f":"IFERROR(VLOOKUP(G6,CoffeeBeans[],6,FALSE),\"\")","v":""},{"$f":"IFERROR(VLOOKUP(H6,CoffeeBeans[],6,FALSE),\"\")","v":""},{"$f":"IFERROR(VLOOKUP(G6,CoffeeBeans[],2,FALSE),\"\")","v":""},{"$f":"IFERROR(VLOOKUP(H6,CoffeeBeans[],2,FALSE),\"\")","v":""}]
["","",null,"",null,"","","",{"$f":"IFERROR(VLOOKUP(G7,CoffeeBeans[],3,FALSE),\"\")","v":""},{"$f":"IFERROR(VLOOKUP(H7,CoffeeBeans[],3,FALSE),\"\")","v":""},{"$f":"IFERROR(VLOOKUP(G7,CoffeeBeans[],4,FALSE),\"\")","v":""},{"$f":"IFERROR(VLOOKUP(H7,CoffeeBeans[],4,FALSE),\"\")","v":""},{"$f":"IFERROR(VLOOKUP(G7,CoffeeBeans[],6,FALSE),\"\")","v":""},{"$f":"IFERROR(VLOOKUP(H7,CoffeeBeans[],6,FALSE),\"\")","v":""},{"$f":"IFERROR(VLOOKUP(G7,CoffeeBeans[],2,FALSE),\"\")","v":""},{"$f":"IFERROR(VLOOKUP(H7,CoffeeBeans[],2,FALSE),\"\")","v":""}]
["","",null,"",{"$f":"IF((E6*2)=E3,\"All Matched\",\"Spare Person\")","v":"All Matched"},"","","",{"$f":"IFERROR(VLOOKUP(G8,CoffeeBeans[],3,FALSE),\"\")","v":""},{"$f":"IFERROR(VLOOKUP(H8,CoffeeBeans[],3,FALSE),\"\")","v":""},{"$f":"IFERROR(VLOOKUP(G8,CoffeeBeans[],4,FALSE),\"\")","v":""},{"$f":"IFERROR(VLOOKUP(H8,CoffeeBeans[],4,FALSE),\"\")","v":""},{"$f":"IFERROR(VLOOKUP(G8,CoffeeBeans[],6,FALSE),\"\")","v":""},{"$f":"IFERROR(VLOOKUP(H8,CoffeeBeans[],6,FALSE),\"\")","v":""},{"$f":"IFERROR(VLOOKUP(G8,CoffeeBeans[],2,FALSE),\"\")","v":""},{"$f":"IFERROR(VLOOKUP(H8,CoffeeBeans[],2,FALSE),\"\")","v":""}]
["","",null,"",null,"","","",{"$f":"IFERROR(VLOOKUP(G9,CoffeeBeans[],3,FALSE),\"\")","v":""},{"$f":"IFERROR(VLOOKUP(H9,CoffeeBeans[],3,FALSE),\"\")","v":""},{"$f":"IFERROR(VLOOKUP(G9,CoffeeBeans[],4,FALSE),\"\")","v":""},{"$f":"IFERROR(VLOOKUP(H9,CoffeeBeans[],4,FALSE),\"\")","v":""},{"$f":"IFERROR(VLOOKUP(G9,CoffeeBeans[],6,FALSE),\"\")","v":""},{"$f":"IFERROR(VLOOKUP(H9,CoffeeBeans[],6,FALSE),\"\")","v":""},{"$f":"IFERROR(VLOOKUP(G9,CoffeeBeans[],2,FALSE),\"\")","v":""},{"$f":"IFERROR(VLOOKUP(H9,CoffeeBeans[],2,FALSE),\"\")","v":""}]
["","",null,"",null,"","","",{"$f":"IFERROR(VLOOKUP(G10,CoffeeBeans[],3,FALSE),\"\")","v":""},{"$f":"IFERROR(VLOOKUP(H10,CoffeeBeans[],3,FALSE),\"\")","v":""},{"$f":"IFERROR(VLOOKUP(G10,CoffeeBeans[],4,FALSE),\"\")","v":""},{"$f":"IFERROR(VLOOKUP(H10,CoffeeBeans[],4,FALSE),\"\")","v":""},{"$f":"IFERROR(VLOOKUP(G10,CoffeeBeans[],6,FALSE),\"\")","v":""},{"$f":"IFERROR(VLOOKUP(H10,CoffeeBeans[],6,FALSE),\"\")","v":""},{"$f":"IFERROR(VLOOKUP(G10,CoffeeBeans[],2,FALSE),\"\")","v":""},{"$f":"IFERROR(VLOOKUP(H10,CoffeeBeans[],2,FALSE),\"\")","v":""}]
["","",null,"",null,"","","",{"$f":"IFERROR(VLOOKUP(G11,CoffeeBeans[],3,FALSE),\"\")","v":""},{"$f":"IFERROR(VLOOKUP(H11,CoffeeBeans[],3,FALSE),\"\")","v":""},{"$f":"IFERROR(VLOOKUP(G11,CoffeeBeans[],4,FALSE),\"\")","v":""},{"$f":"IFERROR(VLOOKUP(H11,CoffeeBeans[],4,FALSE),\"\")","v":""},{"$f":"IFERROR(VLOOKUP(G11,CoffeeBeans[],6,FALSE),\"\")","v":""},{"$f":"IFERROR(VLOOKUP(H11,CoffeeBeans[],6,FALSE),\"\")","v":""},{"$f":"IFERROR(VLOOKUP(G11,CoffeeBeans[],2,FALSE),\"\")","v":""},{"$f":"IFERROR(VLOOKUP(H11,CoffeeBeans[],2,FALSE),\"\")","v":""}]
["","",null,"",null,"","","",{"$f":"IFERROR(VLOOKUP(G12,CoffeeBeans[],3,FALSE),\"\")","v":""},{"$f":"IFERROR(VLOOKUP(H12,CoffeeBeans[],3,FALSE),\"\")","v":""},{"$f":"IFERROR(VLOOKUP(G12,CoffeeBeans[],4,FALSE),\"\")","v":""},{"$f":"IFERROR(VLOOKUP(H12,CoffeeBeans[],4,FALSE),\"\")","v":""},{"$f":"IFERROR(VLOOKUP(G12,CoffeeBeans[],6,FALSE),\"\")","v":""},{"$f":"IFERROR(VLOOKUP(H12,CoffeeBeans[],6,FALSE),\"\")","v":""},{"$f":"IFERROR(VLOOKUP(G12,CoffeeBeans[],2,FALSE),\"\")","v":""},{"$f":"IFERROR(VLOOKUP(H12,CoffeeBeans[],2,FALSE),\"\")","v":""}]
["","",null,"",null,"","","",{"$f":"IFERROR(VLOOKUP(G13,CoffeeBeans[],3,FALSE),\"\")","v":""},{"$f":"IFERROR(VLOOKUP(H13,CoffeeBeans[],3,FALSE),\"\")","v":""},{"$f":"IFERROR(VLOOKUP(G13,CoffeeBeans[],4,FALSE),\"\")","v":""},{"$f":"IFERROR(VLOOKUP(H13,CoffeeBeans[],4,FALSE),\"\")","v":""},{"$f":"IFERROR(VLOOKUP(G13,CoffeeBeans[],6,FALSE),\"\")","v":""},{"$f":"IFERROR(VLOOKUP(H13,CoffeeBeans[],6,FALSE),\"\")","v":""},{"$f":"IFERROR(VLOOKUP(G13,CoffeeBeans[],2,FALSE),\"\")","v":""},{"$f":"IFERROR(VLOOKUP(H13,CoffeeBeans[],2,FALSE),\"\")","v":""}]
["","",null,"",null,"","","",{"$f":"IFERROR(VLOOKUP(G14,CoffeeBeans[],3,FALSE),\"\")","v":""},{"$f":"IFERROR(VLOOKUP(H14,CoffeeBeans[],3,FALSE),\"\")","v":""},{"$f":"IFERROR(VLOOKUP(G14,CoffeeBeans[],4,FALSE),\"\")","v":""},{"$f":"IFERROR(VLOOKUP(H14,CoffeeBeans[],4,FALSE),\"\")","v":""},{"$f":"IFERROR(VLOOKUP(G14,CoffeeBeans[],6,FALSE),\"\")","v":""},{"$f":"IFERROR(VLOOKUP(H14,CoffeeBeans[],6,FALSE),\"\")","v":""},{"$f":"IFERROR(VLOOKUP(G14,CoffeeBeans[],2,FALSE),\"\")","v":""},{"$f":"IFERROR(VLOOKUP(H14,CoffeeBeans[],2,FALSE),\"\")","v":""}]
["","",null,"",null,"","","",{"$f":"IFERROR(VLOOKUP(G15,CoffeeBeans[],3,FALSE),\"\")","v":""},{"$f":"IFERROR(VLOOKUP(H15,CoffeeBeans[],3,FALSE),\"\")","v":""},{"$f":"IFERROR(VLOOKUP(G15,CoffeeBeans[],4,FALSE),\"\")","v":""},{"$f":"IFERROR(VLOOKUP(H15,CoffeeBeans[],4,FALSE),\"\")","v":""},{"$f":"IFERROR(VLOOKUP(G15,CoffeeBeans[],6,FALSE),\"\")","v":""},{"$f":"IFERROR(VLOOKUP(H15,CoffeeBeans[],6,FALSE),\"\")","v":""},{"$f":"IFERROR(VLOOKUP(G15,CoffeeBeans[],2,FALSE),\"\")","v":""},{"$f":"IFERROR(VLOOKUP(H15,CoffeeBeans[],2,FALSE),\"\")","v":""}]
["","",null,"",null,"","","",{"$f":"IFERROR(VLOOKUP(G16,CoffeeBeans[],3,FALSE),\"\")","v":""},{"$f":"IFERROR(VLOOKUP(H16,CoffeeBeans[],3,FALSE),\"\")","v":""},{"$f":"IFERROR(VLOOKUP(G16,CoffeeBeans[],4,FALSE),\"\")","v":""},{"$f":"IFERROR(VLOOKUP(H16,CoffeeBeans[],4,FALSE),\"\")","v":""},{"$f":"IFERROR(VLOOKUP(G16,CoffeeBeans[],6,FALSE),\"\")","v":""},{"$f":"IFERROR(VLOOKUP(H16,CoffeeBeans[],6,FALSE),\"\")","v":""},{"$f":"IFERROR(VLOOKUP(G16,CoffeeBeans[],2,FALSE),\"\")","v":""},{"$f":"IFERROR(VLOOKUP(H16,CoffeeBeans[],2,FALSE),\"\")","v":""}]
["","",null,"",null,"","","",{"$f":"IFERROR(VLOOKUP(G17,CoffeeBeans[],3,FALSE),\"\")","v":""},{"$f":"IFERROR(VLOOKUP(H17,CoffeeBeans[],3,FALSE),\"\")","v":""},{"$f":"IFERROR(VLOOKUP(G17,CoffeeBeans[],4,FALSE),\"\")","v":""},{"$f":"IFERROR(VLOOKUP(H17,CoffeeBeans[],4,FALSE),\"\")","v":""},{"$f":"IFERROR(VLOOKUP(G17,CoffeeBeans[],6,FALSE),\"\")","v":""},{"$f":"IFERROR(VLOOKUP(H17,CoffeeBeans[],6,FALSE),\"\")","v":""},{"$f":"IFERROR(VLOOKUP(G17,CoffeeBeans[],2,FALSE),\"\")","v":""},{"$f":"IFERROR(VLOOKUP(H17,CoffeeBeans[],2,FALSE),\"\")","v":""}]
["","",null,"",null,"","","",{"$f":"IFERROR(VLOOKUP(G18,CoffeeBeans[],3,FALSE),\"\")","v":""},{"$f":"IFERROR(VLOOKUP(H18,CoffeeBeans[],3,FALSE),\"\")","v":""},{"$f":"IFERROR(VLOOKUP(G18,CoffeeBeans[],4,FALSE),\"\")","v":""},{"$f":"IFERROR(VLOOKUP(H18,CoffeeBeans[],4,FALSE),\"\")","v":""},{"$f":"IFERROR(VLOOKUP(G18,CoffeeBeans[],6,FALSE),\"\")","v":""},{"$f":"IFERROR(VLOOKUP(H18,CoffeeBeans[],6,FALSE),\"\")","v":""},{"$f":"IFERROR(VLOOKUP(G18,CoffeeBeans[],2,FALSE),\"\")","v":""},{"$f":"IFERROR(VLOOKUP(H18,CoffeeBeans[],2,FALSE),\"\")","v":""}]
["","",null,"",null,"","","",{"$f":"IFERROR(VLOOKUP(G19,CoffeeBeans[],3,FALSE),\"\")","v":""},{"$f":"IFERROR(VLOOKUP(H19,CoffeeBeans[],3,FALSE),\"\")","v":""},{"$f":"IFERROR(VLOOKUP(G19,CoffeeBeans[],4,FALSE),\"\")","v":""},{"$f":"IFERROR(VLOOKUP(H19,CoffeeBeans[],4,FALSE),\"\")","v":""},{"$f":"IFERROR(VLOOKUP(G19,CoffeeBeans[],6,FALSE),\"\")","v":""},{"$f":"IFERROR(VLOOKUP(H19,CoffeeBeans[],6,FALSE),\"\")","v":""},{"$f":"IFERROR(VLOOKUP(G19,CoffeeBeans[],2,FALSE),\"\")","v":""},{"$f":"IFERROR(VLOOKUP(H19,CoffeeBeans[],2,FALSE),\"\")","v":""}]
["","",null,"",null,"","","",{"$f":"IFERROR(VLOOKUP(G20,CoffeeBeans[],3,FALSE),\"\")","v":""},{"$f":"IFERROR(VLOOKUP(H20,CoffeeBeans[],3,FALSE),\"\")","v":""},{"$f":"IFERROR(VLOOKUP(G20,CoffeeBeans[],4,FALSE),\"\")","v":""},{"$f":"IFERROR(VLOOKUP(H20,CoffeeBeans[],4,FALSE),\"\")","v":""},{"$f":"IFERROR(VLOOKUP(G20,CoffeeBeans[],6,FALSE),\"\")","v":""},{"$f":"IFERROR(VLOOKUP(H20,CoffeeBeans[],6,FALSE),\"\")","v":""},{"$f":"IFERROR(VLOOKUP(G20,CoffeeBeans[],2,FALSE),\"\")","v":""},{"$f":"IFERROR(VLOOKUP(H20,CoffeeBeans[],2,FALSE),\"\")","v":""}]
["","",null,"",null,"","","",{"$f":"IFERROR(VLOOKUP(G21,CoffeeBeans[],3,FALSE),\"\")","v":""},{"$f":"IFERROR(VLOOKUP(H21,CoffeeBeans[],3,FALSE),\"\")","v":""},{"$f":"IFERROR(VLOOKUP(G21,CoffeeBeans[],4,FALSE),\"\")","v":""},{"$f":"IFERROR(VLOOKUP(H21,CoffeeBeans[],4,FALSE),\"\")","v":""},{"$f":"IFERROR(VLOOKUP(G21,CoffeeBeans[],6,FALSE),\"\")","v":""},{"$f":"IFERROR(VLOOKUP(H21,CoffeeBeans[],6,FALSE),\"\")","v":""},{"$f":"IFERROR(VLOOKUP(G21,CoffeeBeans[],2,FALSE),\"\")","v":""},{"$f":"IFERROR(VLOOKUP(H21,CoffeeBeans[],2,FALSE),\"\")","v":""}]
["","",null,"",null,"","","",{"$f":"IFERROR(VLOOKUP(G22,CoffeeBeans[],3,FALSE),\"\")","v":""},{"$f":"IFERROR(VLOOKUP(H22,CoffeeBeans[],3,FALSE),\"\")","v":""},{"$f":"IFERROR(VLOOKUP(G22,CoffeeBeans[],4,FALSE),\"\")","v":""},{"$f":"IFERROR(VLOOKUP(H22,CoffeeBeans[],4,FALSE),\"\")","v":""},{"$f":"IFERROR(VLOOKUP(G22,CoffeeBeans[],6,FALSE),\"\")","v":""},{"$f":"IFERROR(VLOOKUP(H22,CoffeeBeans[],6,FALSE),\"\")","v":""},{"$f":"IFERROR(VLOOKUP(G22,CoffeeBeans[],2,FALSE),\"\")","v":""},{"$f":"IFERROR(VLOOKUP(H22,CoffeeBeans[],2,FALSE),\"\")","v":""}]
["","",null,"",null,"","","",{"$f":"IFERROR(VLOOKUP(G23,CoffeeBeans[],3,FALSE),\"\")","v":""},{"$f":"IFERROR(VLOOKUP(H23,CoffeeBeans[],3,FALSE),\"\")","v":""},{"$f":"IFERROR(VLOOKUP(G23,CoffeeBeans[],4,FALSE),\"\")","v":""},{"$f":"IFERROR(VLOOKUP(H23,CoffeeBeans[],4,FALSE),\"\")","v":""},{"$f":"IFERROR(VLOOKUP(G23,CoffeeBeans[],6,FALSE),\"\")","v":""},{"$f":"IFERROR(VLOOKUP(H23,CoffeeBeans[],6,FALSE),\"\")","v":""},{"$f":"IFERROR(VLOOKUP(G23,CoffeeBeans[],2,FALSE),\"\")","v":""},{"$f":"IFERROR(VLOOKUP(H23,CoffeeBeans[],2,FALSE),\"\")","v":""}]
["","",null,"",null,"","","",{"$f":"IFERROR(VLOOKUP(G24,CoffeeBeans[],3,FALSE),\"\")","v":""},{"$f":"IFERROR(VLOOKUP(H24,CoffeeBeans[],3,FALSE),\"\")","v":""},{"$f":"IFERROR(VLOOKUP(G24,CoffeeBeans[],4,FALSE),\"\")","v":""},{"$f":"IFERROR(VLOOKUP(H24,CoffeeBeans[],4,FALSE),\"\")","v":""},{"$f":"IFERROR(VLOOKUP(G24,CoffeeBeans[],6,FALSE),\"\")","v":""},{"$f":"IFERROR(VLOOKUP(H24,CoffeeBeans[],6,FALSE),\"\")","v":""},{"$f":"IFERROR(VLOOKUP(G24,CoffeeBeans[],2,FALSE),\"\")","v":""},{"$f":"IFERROR(VLOOKUP(H24,CoffeeBeans[],2,FALSE),\"\")","v":""}]
["","",null,"",null,"","","",{"$f":"IFERROR(VLOOKUP(G25,CoffeeBeans[],3,FALSE),\"\")","v":""},{"$f":"IFERROR(VLOOKUP(H25,CoffeeBeans[],3,FALSE),\"\")","v":""},{"$f":"IFERROR(VLOOKUP(G25,CoffeeBeans[],4,FALSE),\"\")","v":""},{"$f":"IFERROR(VLOOKUP(H25,CoffeeBeans[],4,FALSE),\"\")","v":""},{"$f":"IFERROR(VLOOKUP(G25,CoffeeBeans[],6,FALSE),\"\")","v":""},{"$f":"IFERROR(VLOOKUP(H25,CoffeeBeans[],6,FALSE),\"\")","v":""},{"$f":"IFERROR(VLOOKUP(G25,CoffeeBeans[],2,FALSE),\"\")","v":""},{"$f":"IFERROR(VLOOKUP(H25,CoffeeBeans[],2,FALSE),\"\")","v":""}]
["","",null,"",null,"","","",{"$f":"IFERROR(VLOOKUP(G26,CoffeeBeans[],3,FALSE),\"\")","v":""},{"$f":"IFERROR(VLOOKUP(H26,CoffeeBeans[],3,FALSE),\"\")","v":""},{"$f":"IFERROR(VLOOKUP(G26,CoffeeBeans[],4,FALSE),\"\")","v":""},{"$f":"IFERROR(VLOOKUP(H26,CoffeeBeans[],4,FALSE),\"\")","v":""},{"$f":"IFERROR(VLOOKUP(G26,CoffeeBeans[],6,FALSE),\"\")","v":""},{"$f":"IFERROR(VLOOKUP(H26,CoffeeBeans[],6,FALSE),\"\")","v":""},{"$f":"IFERROR(VLOOKUP(G26,CoffeeBeans[],2,FALSE),\"\")","v":""},{"$f":"IFERROR(VLOOKUP(H26,CoffeeBeans[],2,FALSE),\"\")","v":""}]
["","",null,"",null,"","","",{"$f":"IFERROR(VLOOKUP(G27,CoffeeBeans[],3,FALSE),\"\")","v":""},{"$f":"IFERROR(VLOOKUP(H27,CoffeeBeans[],3,FALSE),\"\")","v":""},{"$f":"IFERROR(VLOOKUP(G27,CoffeeBeans[],4,FALSE),\"\")","v":""},{"$f":"IFERROR(VLOOKUP(H27,CoffeeBeans[],4,FALSE),\"\")","v":""},{"$f":"IFERROR(VLOOKUP(G27,CoffeeBeans[],6,FALSE),\"\")","v":""},{"$f":"IFERROR(VLOOKUP(H27,CoffeeBeans[],6,FALSE),\"\")","v":""},{"$f":"IFERROR(VLOOKUP(G27,CoffeeBeans[],2,FALSE),\"\")","v":""},{"$f":"IFERROR(VLOOKUP(H27,CoffeeBeans[],2,FALSE),\"\")","v":""}]
["","",null,"",null,"","","",{"$f":"IFERROR(VLOOKUP(G28,CoffeeBeans[],3,FALSE),\"\")","v":""},{"$f":"IFERROR(VLOOKUP(H28,CoffeeBeans[],3,FALSE),\"\")","v":""},{"$f":"IFERROR(VLOOKUP(G28,CoffeeBeans[],4,FALSE),\"\")","v":""},{"$f":"IFERROR(VLOOKUP(H28,CoffeeBeans[],4,FALSE),\"\")","v":""},{"$f":"IFERROR(VLOOKUP(G28,CoffeeBeans[],6,FALSE),\"\")","v":""},{"$f":"IFERROR(VLOOKUP(H28,CoffeeBeans[],6,FALSE),\"\")","v":""},{"$f":"IFERROR(VLOOKUP(G28,CoffeeBeans[],2,FALSE),\"\")","v":""},{"$f":"IFERROR(VLOOKUP(H28,CoffeeBeans[],2,FALSE),\"\")","v":""}]
["","",null,"",null,"","","",{"$f":"IFERROR(VLOOKUP(G29,CoffeeBeans[],3,FALSE),\"\")","v":""},{"$f":"IFERROR(VLOOKUP(H29,CoffeeBeans[],3,FALSE),\"\")","v":""},{"$f":"IFERROR(VLOOKUP(G29,CoffeeBeans[],4,FALSE),\"\")","v":""},{"$f":"IFERROR(VLOOKUP(H29,CoffeeBeans[],4,FALSE),\"\")","v":""},{"$f":"IFERROR(VLOOKUP(G29,CoffeeBeans[],6,FALSE),\"\")","v":""},{"$f":"IFERROR(VLOOKUP(H29,CoffeeBeans[],6,FALSE),\"\")","v":""},{"$f":"IFERROR(VLOOKUP(G29,CoffeeBeans[],2,FALSE),\"\")","v":""},{"$f":"IFERROR(VLOOKUP(H29,CoffeeBeans[],2,FALSE),\"\")","v":""}]
["","",null,"",null,"","","",{"$f":"IFERROR(VLOOKUP(G30,CoffeeBeans[],3,FALSE),\"\")","v":""},{"$f":"IFERROR(VLOOKUP(H30,CoffeeBeans[],3,FALSE),\"\")","v":""},{"$f":"IFERROR(VLOOKUP(G30,CoffeeBeans[],4,FALSE),\"\")","v":""},{"$f":"IFERROR(VLOOKUP(H30,CoffeeBeans[],4,FALSE),\"\")","v":""},{"$f":"IFERROR(VLOOKUP(G30,CoffeeBeans[],6,FALSE),\"\")","v":""},{"$f":"IFERROR(VLOOKUP(H30,CoffeeBeans[],6,FALSE),\"\")","v":""},{"$f":"IFERROR(VLOOKUP(G30,CoffeeBeans[],2,FALSE),\"\")","v":""},{"$f":"IFERROR(VLOOKUP(H30,CoffeeBeans[],2,FALSE),\"\")","v":""}]
["","",null,"",null,"","","",{"$f":"IFERROR(VLOOKUP(G31,CoffeeBeans[],3,FALSE),\"\")","v":""},{"$f":"IFERROR(VLOOKUP(H31,CoffeeBeans[],3,FALSE),\"\")","v":""},{"$f":"IFERROR(VLOOKUP(G31,CoffeeBeans[],4,FALSE),\"\")","v":""},{"$f":"IFERROR(VLOOKUP(H31,CoffeeBeans[],4,FALSE),\"\")","v":""},{"$f":"IFERROR(VLOOKUP(G31,CoffeeBeans[],6,FALSE),\"\")","v":""},{"$f":"IFERROR(VLOOKUP(H31,CoffeeBeans[],6,FALSE),\"\")","v":""},{"$f":"IFERROR(VLOOKUP(G31,CoffeeBeans[],2,FALSE),\"\")","v":""},{"$f":"IFERROR(VLOOKUP(H31,CoffeeBeans[],2,FALSE),\"\")","v":""}]
["","",null,"",null,"","","",{"$f":"IFERROR(VLOOKUP(G32,CoffeeBeans[],3,FALSE),\"\")","v":""},{"$f":"IFERROR(VLOOKUP(H32,CoffeeBeans[],3,FALSE),\"\")","v":""},{"$f":"IFERROR(VLOOKUP(G32,CoffeeBeans[],4,FALSE),\"\")","v":""},{"$f":"IFERROR(VLOOKUP(H32,CoffeeBeans[],4,FALSE),\"\")","v":""},{"$f":"IFERROR(VLOOKUP(G32,CoffeeBeans[],6,FALSE),\"\")","v":""},{"$f":"IFERROR(VLOOKUP(H32,CoffeeBeans[],6,FALSE),\"\")","v":""},{"$f":"IFERROR(VLOOKUP(G32,CoffeeBeans[],2,FALSE),\"\")","v":""},{"$f":"IFERROR(VLOOKUP(H32,CoffeeBeans[],2,FALSE),\"\")","v":""}]
["","",null,"",null,"","","",{"$f":"IFERROR(VLOOKUP(G33,CoffeeBeans[],3,FALSE),\"\")","v":""},{"$f":"IFERROR(VLOOKUP(H33,CoffeeBeans[],3,FALSE),\"\")","v":""},{"$f":"IFERROR(VLOOKUP(G33,CoffeeBeans[],4,FALSE),\"\")","v":""},{"$f":"IFERROR(VLOOKUP(H33,CoffeeBeans[],4,FALSE),\"\")","v":""},{"$f":"IFERROR(VLOOKUP(G33,CoffeeBeans[],6,FALSE),\"\")","v":""},{"$f":"IFERROR(VLOOKUP(H33,CoffeeBeans[],6,FALSE),\"\")","v":""},{"$f":"IFERROR(VLOOKUP(G33,CoffeeBeans[],2,FALSE),\"\")","v":""},{"$f":"IFERROR(VLOOKUP(H33,CoffeeBeans[],2,FALSE),\"\")","v":""}]
["","",null,"",null,"","","",{"$f":"IFERROR(VLOOKUP(G34,CoffeeBeans[],3,FALSE),\"\")","v":""},{"$f":"IFERROR(VLOOKUP(H34,CoffeeBeans[],3,FALSE),\"\")","v":""},{"$f":"IFERROR(VLOOKUP(G34,CoffeeBeans[],4,FALSE),\"\")","v":""},{"$f":"IFERROR(VLOOKUP(H34,CoffeeBeans[],4,FALSE),\"\")","v":""},{"$f":"IFERROR(VLOOKUP(G34,CoffeeBeans[],6,FALSE),\"\")","v":""},{"$f":"IFERROR(VLOOKUP(H34,CoffeeBeans[],6,FALSE),\"\")","v":""},{"$f":"IFERROR(VLOOKUP(G34,CoffeeBeans[],2,FALSE),\"\")","v":""},{"$f":"IFERROR(VLOOKUP(H34,CoffeeBeans[],2,FALSE),\"\")","v":""}]
["","",null,"",null,"","","",{"$f":"IFERROR(VLOOKUP(G35,CoffeeBeans[],3,FALSE),\"\")","v":""},{"$f":"IFERROR(VLOOKUP(H35,CoffeeBeans[],3,FALSE),\"\")","v":""},{"$f":"IFERROR(VLOOKUP(G35,CoffeeBeans[],4,FALSE),\"\")","v":""},{"$f":"IFERROR(VLOOKUP(H35,CoffeeBeans[],4,FALSE),\"\")","v":""},{"$f":"IFERROR(VLOOKUP(G35,CoffeeBeans[],6,FALSE),\"\")","v":""},{"$f":"IFERROR(VLOOKUP(H35,CoffeeBeans[],6,FALSE),\"\")","v":""},{"$f":"IFERROR(VLOOKUP(G35,CoffeeBeans[],2,FALSE),\"\")","v":""},{"$f":"IFERROR(VLOOKUP(H35,CoffeeBeans[],2,FALSE),\"\")","v":""}]
["","",null,"",null,"","","",{"$f":"IFERROR(VLOOKUP(G36,CoffeeBeans[],3,FALSE),\"\")","v":""},{"$f":"IFERROR(VLOOKUP(H36,CoffeeBeans[],3,FALSE),\"\")","v":""},{"$f":"IFERROR(VLOOKUP(G36,CoffeeBeans[],4,FALSE),\"\")","v":""},{"$f":"IFERROR(VLOOKUP(H36,CoffeeBeans[],4,FALSE),\"\")","v":""},{"$f":"IFERROR(VLOOKUP(G36,CoffeeBeans[],6,FALSE),\"\")","v":""},{"$f":"IFERROR(VLOOKUP(H36,CoffeeBeans[],6,FALSE),\"\")","v":""},{"$f":"IFERROR(VLOOKUP(G36,CoffeeBeans[],2,FALSE),\"\")","v":""},{"$f":"IFERROR(VLOOKUP(H36,CoffeeBeans[],2,FALSE),\"\")","v":""}]
["","",null,"",null,"","","",{"$f":"IFERROR(VLOOKUP(G37,CoffeeBeans[],3,FALSE),\"\")","v":""},{"$f":"IFERROR(VLOOKUP(H37,CoffeeBeans[],3,FALSE),\"\")","v":""},{"$f":"IFERROR(VLOOKUP(G37,CoffeeBeans[],4,FALSE),\"\")","v":""},{"$f":"IFERROR(VLOOKUP(H37,CoffeeBeans[],4,FALSE),\"\")","v":""},{"$f":"IFERROR(VLOOKUP(G37,CoffeeBeans[],6,FALSE),\"\")","v":""},{"$f":"IFERROR(VLOOKUP(H37,CoffeeBeans[],6,FALSE),\"\")","v":""},{"$f":"IFERROR(VLOOKUP(G37,CoffeeBeans[],2,FALSE),\"\")","v":""},{"$f":"IFERROR(VLOOKUP(H37,CoffeeBeans[],2,FALSE),\"\")","v":""}]
["","",null,"",null,"","","",{"$f":"IFERROR(VLOOKUP(G38,CoffeeBeans[],3,FALSE),\"\")","v":""},{"$f":"IFERROR(VLOOKUP(H38,CoffeeBeans[],3,FALSE),\"\")","v":""},{"$f":"IFERROR(VLOOKUP(G38,CoffeeBeans[],4,FALSE),\"\")","v":""},{"$f":"IFERROR(VLOOKUP(H38,CoffeeBeans[],4,FALSE),\"\")","v":""},{"$f":"IFERROR(VLOOKUP(G38,CoffeeBeans[],6,FALSE),\"\")","v":""},{"$f":"IFERROR(VLOOKUP(H38,CoffeeBeans[],6,FALSE),\"\")","v":""},{"$f":"IFERROR(VLOOKUP(G38,CoffeeBeans[],2,FALSE),\"\")","v":""},{"$f":"IFERROR(VLOOKUP(H38,CoffeeBeans[],2,FALSE),\"\")","v":""}]
["","",null,"",null,"","","",{"$f":"IFERROR(VLOOKUP(G39,CoffeeBeans[],3,FALSE),\"\")","v":""},{"$f":"IFERROR(VLOOKUP(H39,CoffeeBeans[],3,FALSE),\"\")","v":""},{"$f":"IFERROR(VLOOKUP(G39,CoffeeBeans[],4,FALSE),\"\")","v":""},{"$f":"IFERROR(VLOOKUP(H39,CoffeeBeans[],4,FALSE),\"\")","v":""},{"$f":"IFERROR(VLOOKUP(G39,CoffeeBeans[],6,FALSE),\"\")","v":""},{"$f":"IFERROR(VLOOKUP(H39,CoffeeBeans[],6,FALSE),\"\")","v":""},{"$f":"IFERROR(VLOOKUP(G39,CoffeeBeans[],2,FALSE),\"\")","v":""},{"$f":"IFERROR(VLOOKUP(H39,CoffeeBeans[],2,FALSE),\"\")","v":""}]
["","",null,"",null,"","","",{"$f":"IFERROR(VLOOKUP(G40,CoffeeBeans[],3,FALSE),\"\")","v":""},{"$f":"IFERROR(VLOOKUP(H40,CoffeeBeans[],3,FALSE),\"\")","v":""},{"$f":"IFERROR(VLOOKUP(G40,CoffeeBeans[],4,FALSE),\"\")","v":""},{"$f":"IFERROR(VLOOKUP(H40,CoffeeBeans[],4,FALSE),\"\")","v":""},{"$f":"IFERROR(VLOOKUP(G40,CoffeeBeans[],6,FALSE),\"\")","v":""},{"$f":"IFERROR(VLOOKUP(H40,CoffeeBeans[],6,FALSE),\"\")","v":""},{"$f":"IFERROR(VLOOKUP(G40,CoffeeBeans[],2,FALSE),\"\")","v":""},{"$f":"IFERROR(VLOOKUP(H40,CoffeeBeans[],2,FALSE),\"\")","v":""}]
["","",null,"",null,"","","",{"$f":"IFERROR(VLOOKUP(G41,CoffeeBeans[],3,FALSE),\"\")","v":""},{"$f":"IFERROR(VLOOKUP(H41,CoffeeBeans[],3,FALSE),\"\")","v":""},{"$f":"IFERROR(VLOOKUP(G41,CoffeeBeans[],4,FALSE),\"\")","v":""},{"$f":"IFERROR(VLOOKUP(H41,CoffeeBeans[],4,FALSE),\"\")","v":""},{"$f":"IFERROR(VLOOKUP(G41,CoffeeBeans[],6,FALSE),\"\")","v":""},{"$f":"IFERROR(VLOOKUP(H41,CoffeeBeans[],6,FALSE),\"\")","v":""},{"$f":"IFERROR(VLOOKUP(G41,CoffeeBeans[],2,FALSE),\"\")","v":""},{"$f":"IFERROR(VLOOKUP(H41,CoffeeBeans[],2,FALSE),\"\")","v":""}]
["","",null,"",null,"","","",{"$f":"IFERROR(VLOOKUP(G42,CoffeeBeans[],3,FALSE),\"\")","v":""},{"$f":"IFERROR(VLOOKUP(H42,CoffeeBeans[],3,FALSE),\"\")","v":""},{"$f":"IFERROR(VLOOKUP(G42,CoffeeBeans[],4,FALSE),\"\")","v":""},{"$f":"IFERROR(VLOOKUP(H42,CoffeeBeans[],4,FALSE),\"\")","v":""},{"$f":"IFERROR(VLOOKUP(G42,CoffeeBeans[],6,FALSE),\"\")","v":""},{"$f":"IFERROR(VLOOKUP(H42,CoffeeBeans[],6,FALSE),\"\")","v":""},{"$f":"IFERROR(VLOOKUP(G42,CoffeeBeans[],2,FALSE),\"\")","v":""},{"$f":"IFERROR(VLOOKUP(H42,CoffeeBeans[],2,FALSE),\"\")","v":""}]
["","",null,"",null,"","","",{"$f":"IFERROR(VLOOKUP(G43,CoffeeBeans[],3,FALSE),\"\")","v":""},{"$f":"IFERROR(VLOOKUP(H43,CoffeeBeans[],3,FALSE),\"\")","v":""},{"$f":"IFERROR(VLOOKUP(G43,CoffeeBeans[],4,FALSE),\"\")","v":""},{"$f":"IFERROR(VLOOKUP(H43,CoffeeBeans[],4,FALSE),\"\")","v":""},{"$f":"IFERROR(VLOOKUP(G43,CoffeeBeans[],6,FALSE),\"\")","v":""},{"$f":"IFERROR(VLOOKUP(H43,CoffeeBeans[],6,FALSE),\"\")","v":""},{"$f":"IFERROR(VLOOKUP(G43,CoffeeBeans[],2,FALSE),\"\")","v":""},{"$f":"IFERROR(VLOOKUP(H43,CoffeeBeans[],2,FALSE),\"\")","v":""}]
["","",null,"",null,"","","",{"$f":"IFERROR(VLOOKUP(G44,CoffeeBeans[],3,FALSE),\"\")","v":""},{"$f":"IFERROR(VLOOKUP(H44,CoffeeBeans[],3,FALSE),\"\")","v":""},{"$f":"IFERROR(VLOOKUP(G44,CoffeeBeans[],4,FALSE),\"\")","v":""},{"$f":"IFERROR(VLOOKUP(H44,CoffeeBeans[],4,FALSE),\"\")","v":""},{"$f":"IFERROR(VLOOKUP(G44,CoffeeBeans[],6,FALSE),\"\")","v":""},{"$f":"IFERROR(VLOOKUP(H44,CoffeeBeans[],6,FALSE),\"\")","v":""},{"$f":"IFERROR(VLOOKUP(G44,CoffeeBeans[],2,FALSE),\"\")","v":""},{"$f":"IFERROR(VLOOKUP(H44,CoffeeBeans[],2,FALSE),\"\")","v":""}]
["","",null,"",null,"","","",{"$f":"IFERROR(VLOOKUP(G45,CoffeeBeans[],3,FALSE),\"\")","v":""},{"$f":"IFERROR(VLOOKUP(H45,CoffeeBeans[],3,FALSE),\"\")","v":""},{"$f":"IFERROR(VLOOKUP(G45,CoffeeBeans[],4,FALSE),\"\")","v":""},{"$f":"IFERROR(VLOOKUP(H45,CoffeeBeans[],4,FALSE),\"\")","v":""},{"$f":"IFERROR(VLOOKUP(G45,CoffeeBeans[],6,FALSE),\"\")","v":""},{"$f":"IFERROR(VLOOKUP(H45,CoffeeBeans[],6,FALSE),\"\")","v":""},{"$f":"IFERROR(VLOOKUP(G45,CoffeeBeans[],2,FALSE),\"\")","v":""},{"$f":"IFERROR(VLOOKUP(H45,CoffeeBeans[],2,FALSE),\"\")","v":""}]
["","",null,"",null,"","","",{"$f":"IFERROR(VLOOKUP(G46,CoffeeBeans[],3,FALSE),\"\")","v":""},{"$f":"IFERROR(VLOOKUP(H46,CoffeeBeans[],3,FALSE),\"\")","v":""},{"$f":"IFERROR(VLOOKUP(G46,CoffeeBeans[],4,FALSE),\"\")","v":""},{"$f":"IFERROR(VLOOKUP(H46,CoffeeBeans[],4,FALSE),\"\")","v":""},{"$f":"IFERROR(VLOOKUP(G46,CoffeeBeans[],6,FALSE),\"\")","v":""},{"$f":"IFERROR(VLOOKUP(H46,CoffeeBeans[],6,FALSE),\"\")","v":""},{"$f":"IFERROR(VLOOKUP(G46,CoffeeBeans[],2,FALSE),\"\")","v":""},{"$f":"IFERROR(VLOOKUP(H46,CoffeeBeans[],2,FALSE),\"\")","v":""}]
["","",null,"",null,"","","",{"$f":"IFERROR(VLOOKUP(G47,CoffeeBeans[],3,FALSE),\"\")","v":""},{"$f":"IFERROR(VLOOKUP(H47,CoffeeBeans[],3,FALSE),\"\")","v":""},{"$f":"IFERROR(VLOOKUP(G47,CoffeeBeans[],4,FALSE),\"\")","v":""},{"$f":"IFERROR(VLOOKUP(H47,CoffeeBeans[],4,FALSE),\"\")","v":""},{"$f":"IFERROR(VLOOKUP(G47,CoffeeBeans[],6,FALSE),\"\")","v":""},{"$f":"IFERROR(VLOOKUP(H47,CoffeeBeans[],6,FALSE),\"\")","v":""},{"$f":"IFERROR(VLOOKUP(G47,CoffeeBeans[],2,FALSE),\"\")","v":""},{"$f":"IFERROR(VLOOKUP(H47,CoffeeBeans[],2,FALSE),\"\")","v":""}]
["","",null,"",null,"","","",{"$f":"IFERROR(VLOOKUP(G48,CoffeeBeans[],3,FALSE),\"\")","v":""},{"$f":"IFERROR(VLOOKUP(H48,CoffeeBeans[],3,FALSE),\"\")","v":""},{"$f":"IFERROR(VLOOKUP(G48,CoffeeBeans[],4,FALSE),\"\")","v":""},{"$f":"IFERROR(VLOOKUP(H48,CoffeeBeans[],4,FALSE),\"\")","v":""},{"$f":"IFERROR(VLOOKUP(G48,CoffeeBeans[],6,FALSE),\"\")","v":""},{"$f":"IFERROR(VLOOKUP(H48,CoffeeBeans[],6,FALSE),\"\")","v":""},{"$f":"IFERROR(VLOOKUP(G48,CoffeeBeans[],2,FALSE),\"\")","v":""},{"$f":"IFERROR(VLOOKUP(H48,CoffeeBeans[],2,FALSE),\"\")","v":""}]
["","",null,"",null,"","","",{"$f":"IFERROR(VLOOKUP(G49,CoffeeBeans[],3,FALSE),\"\")","v":""},{"$f":"IFERROR(VLOOKUP(H49,CoffeeBeans[],3,FALSE),\"\")","v":""},{"$f":"IFERROR(VLOOKUP(G49,CoffeeBeans[],4,FALSE),\"\")","v":""},{"$f":"IFERROR(VLOOKUP(H49,CoffeeBeans[],4,FALSE),\"\")","v":""},{"$f":"IFERROR(VLOOKUP(G49,CoffeeBeans[],6,FALSE),\"\")","v":""},{"$f":"IFERROR(VLOOKUP(H49,CoffeeBeans[],6,FALSE),\"\")","v":""},{"$f":"IFERROR(VLOOKUP(G49,CoffeeBeans[],2,FALSE),\"\")","v":""},{"$f":"IFERROR(VLOOKUP(H49,CoffeeBeans[],2,FALSE),\"\")","v":""}]
["","",null,"",null,"","","",{"$f":"IFERROR(VLOOKUP(G50,CoffeeBeans[],3,FALSE),\"\")","v":""},{"$f":"IFERROR(VLOOKUP(H50,CoffeeBeans[],3,FALSE),\"\")","v":""},{"$f":"IFERROR(VLOOKUP(G50,CoffeeBeans[],4,FALSE),\"\")","v":""},{"$f":"IFERROR(VLOOKUP(H50,CoffeeBeans[],4,FALSE),\"\")","v":""},{"$f":"IFERROR(VLOOKUP(G50,CoffeeBeans[],6,FALSE),\"\")","v":""},{"$f":"IFERROR(VLOOKUP(H50,CoffeeBeans[],6,FALSE),\"\")","v":""},{"$f":"IFERROR(VLOOKUP(G50,CoffeeBeans[],2,FALSE),\"\")","v":""},{"$f":"IFERROR(VLOOKUP(H50,CoffeeBeans[],2,FALSE),\"\")","v":""}]
["","",null,"",null,"","","",{"$f":"IFERROR(VLOOKUP(G51,CoffeeBeans[],3,FALSE),\"\")","v":""},{"$f":"IFERROR(VLOOKUP(H51,CoffeeBeans[],3,FALSE),\"\")","v":""},{"$f":"IFERROR(VLOOKUP(G51,CoffeeBeans[],4,FALSE),\"\")","v":""},{"$f":"IFERROR(VLOOKUP(H51,CoffeeBeans[],4,FALSE),\"\")","v":""},{"$f":"IFERROR(VLOOKUP(G51,CoffeeBeans[],6,FALSE),\"\")","v":""},{"$f":"IFERROR(VLOOKUP(H51,CoffeeBeans[],6,FALSE),\"\")","v":""},{"$f":"IFERROR(VLOOKUP(G51,CoffeeBeans[],2,FALSE),\"\")","v":""},{"$f":"IFERROR(VLOOKUP(H51,CoffeeBeans[],2,FALSE),\"\")","v":""}]
["","",null,"",null,"","","",{"$f":"IFERROR(VLOOKUP(G52,CoffeeBeans[],3,FALSE),\"\")","v":""},{"$f":"IFERROR(VLOOKUP(H52,CoffeeBeans[],3,FALSE),\"\")","v":""},{"$f":"IFERROR(VLOOKUP(G52,CoffeeBeans[],4,FALSE),\"\")","v":""},{"$f":"IFERROR(VLOOKUP(H52,CoffeeBeans[],4,FALSE),\"\")","v":""},{"$f":"IFERROR(VLOOKUP(G52,CoffeeBeans[],6,FALSE),\"\")","v":""},{"$f":"IFERROR(VLOOKUP(H52,CoffeeBeans[],6,FALSE),\"\")","v":""},{"$f":"IFERROR(VLOOKUP(G52,CoffeeBeans[],2,FALSE),\"\")","v":""},{"$f":"IFERROR(VLOOKUP(H52,CoffeeBeans[],2,FALSE),\"\")","v":""}]
["","",null,"",null,"","","",{"$f":"IFERROR(VLOOKUP(G53,CoffeeBeans[],3,FALSE),\"\")","v":""},{"$f":"IFERROR(VLOOKUP(H53,CoffeeBeans[],3,FALSE),\"\")","v":""},{"$f":"IFERROR(VLOOKUP(G53,CoffeeBeans[],4,FALSE),\"\")","v":""},{"$f":"IFERROR(VLOOKUP(H53,CoffeeBeans[],4,FALSE),\"\")","v":""},{"$f":"IFERROR(VLOOKUP(G53,CoffeeBeans[],6,FALSE),\"\")","v":""},{"$f":"IFERROR(VLOOKUP(H53,CoffeeBeans[],6,FALSE),\"\")","v":""},{"$f":"IFERROR(VLOOKUP(G53,CoffeeBeans[],2,FALSE),\"\")","v":""},{"$f":"IFERROR(VLOOKUP(H53,CoffeeBeans[],2,FALSE),\"\")","v":""}]
["","",null,"",null,"","","",{"$f":"IFERROR(VLOOKUP(G54,CoffeeBeans[],3,FALSE),\"\")","v":""},{"$f":"IFERROR(VLOOKUP(H54,CoffeeBeans[],3,FALSE),\"\")","v":""},{"$f":"IFERROR(VLOOKUP(G54,CoffeeBeans[],4,FALSE),\"\")","v":""},{"$f":"IFERROR(VLOOKUP(H54,CoffeeBeans[],4,FALSE),\"\")","v":""},{"$f":"IFERROR(VLOOKUP(G54,CoffeeBeans[],6,FALSE),\"\")","v":""},{"$f":"IFERROR(VLOOKUP(H54,CoffeeBeans[],6,FALSE),\"\")","v":""},{"$f":"IFERROR(VLOOKUP(G54,CoffeeBeans[],2,FALSE),\"\")","v":""},{"$f":"IFERROR(VLOOKUP(H54,CoffeeBeans[],2,FALSE),\"\")","v":""}]
["","",null,"",null,"","","",{"$f":"IFERROR(VLOOKUP(G55,CoffeeBeans[],3,FALSE),\"\")","v":""},{"$f":"IFERROR(VLOOKUP(H55,CoffeeBeans[],3,FALSE),\"\")","v":""},{"$f":"IFERROR(VLOOKUP(G55,CoffeeBeans[],4,FALSE),\"\")","v":""},{"$f":"IFERROR(VLOOKUP(H55,CoffeeBeans[],4,FALSE),\"\")","v":""},{"$f":"IFERROR(VLOOKUP(G55,CoffeeBeans[],6,FALSE),\"\")","v":""},{"$f":"IFERROR(VLOOKUP(H55,CoffeeBeans[],6,FALSE),\"\")","v":""},{"$f":"IFERROR(VLOOKUP(G55,CoffeeBeans[],2,FALSE),\"\")","v":""},{"$f":"IFERROR(VLOOKUP(H55,CoffeeBeans[],2,FALSE),\"\")","v":""}]
["","",null,"",null,"","","",{"$f":"IFERROR(VLOOKUP(G56,CoffeeBeans[],3,FALSE),\"\")","v":""},{"$f":"IFERROR(VLOOKUP(H56,CoffeeBeans[],3,FALSE),\"\")","v":""},{"$f":"IFERROR(VLOOKUP(G56,CoffeeBeans[],4,FALSE),\"\")","v":""},{"$f":"IFERROR(VLOOKUP(H56,CoffeeBeans[],4,FALSE),\"\")","v":""},{"$f":"IFERROR(VLOOKUP(G56,CoffeeBeans[],6,FALSE),\"\")","v":""},{"$f":"IFERROR(VLOOKUP(H56,CoffeeBeans[],6,FALSE),\"\")","v":""},{"$f":"IFERROR(VLOOKUP(G56,CoffeeBeans[],2,FALSE),\"\")","v":""},{"$f":"IFERROR(VLOOKUP(H56,CoffeeBeans[],2,FALSE),\"\")","v":""}]
["","",null,"",null,"","","",{"$f":"IFERROR(VLOOKUP(G57,CoffeeBeans[],3,FALSE),\"\")","v":""},{"$f":"IFERROR(VLOOKUP(H57,CoffeeBeans[],3,FALSE),\"\")","v":""},{"$f":"IFERROR(VLOOKUP(G57,CoffeeBeans[],4,FALSE),\"\")","v":""},{"$f":"IFERROR(VLOOKUP(H57,CoffeeBeans[],4,FALSE),\"\")","v":""},{"$f":"IFERROR(VLOOKUP(G57,CoffeeBeans[],6,FALSE),\"\")","v":""},{"$f":"IFERROR(VLOOKUP(H57,CoffeeBeans[],6,FALSE),\"\")","v":""},{"$f":"IFERROR(VLOOKUP(G57,CoffeeBeans[],2,FALSE),\"\")","v":""},{"$f":"IFERROR(VLOOKUP(H57,CoffeeBeans[],2,FALSE),\"\")","v":""}]
["","",null,"",null,"","","",{"$f":"IFERROR(VLOOKUP(G58,CoffeeBeans[],3,FALSE),\"\")","v":""},{"$f":"IFERROR(VLOOKUP(H58,CoffeeBeans[],3,FALSE),\"\")","v":""},{"$f":"IFERROR(VLOOKUP(G58,CoffeeBeans[],4,FALSE),\"\")","v":""},{"$f":"IFERROR(VLOOKUP(H58,CoffeeBeans[],4,FALSE),\"\")","v":""},{"$f":"IFERROR(VLOOKUP(G58,CoffeeBeans[],6,FALSE),\"\")","v":""},{"$f":"IFERROR(VLOOKUP(H58,CoffeeBeans[],6,FALSE),\"\")","v":""},{"$f":"IFERROR(VLOOKUP(G58,CoffeeBeans[],2,FALSE),\"\")","v":""},{"$f":"IFERROR(VLOOKUP(H58,CoffeeBeans[],2,FALSE),\"\")","v":""}]
["","",null,"",null,"","","",{"$f":"IFERROR(VLOOKUP(G59,CoffeeBeans[],3,FALSE),\"\")","v":""},{"$f":"IFERROR(VLOOKUP(H59,CoffeeBeans[],3,FALSE),\"\")","v":""},{"$f":"IFERROR(VLOOKUP(G59,CoffeeBeans[],4,FALSE),\"\")","v":""},{"$f":"IFERROR(VLOOKUP(H59,CoffeeBeans[],4,FALSE),\"\")","v":""},{"$f":"IFERROR(VLOOKUP(G59,CoffeeBeans[],6,FALSE),\"\")","v":""},{"$f":"IFERROR(VLOOKUP(H59,CoffeeBeans[],6,FALSE),\"\")","v":""},{"$f":"IFERROR(VLOOKUP(G59,CoffeeBeans[],2,FALSE),\"\")","v":""},{"$f":"IFERROR(VLOOKUP(H59,CoffeeBeans[],2,FALSE),\"\")","v":""}]
["","",null,"",null,"","","",{"$f":"IFERROR(VLOOKUP(G60,CoffeeBeans[],3,FALSE),\"\")","v":""},{"$f":"IFERROR(VLOOKUP(H60,CoffeeBeans[],3,FALSE),\"\")","v":""},{"$f":"IFERROR(VLOOKUP(G60,CoffeeBeans[],4,FALSE),\"\")","v":""},{"$f":"IFERROR(VLOOKUP(H60,CoffeeBeans[],4,FALSE),\"\")","v":""},{"$f":"IFERROR(VLOOKUP(G60,CoffeeBeans[],6,FALSE),\"\")","v":""},{"$f":"IFERROR(VLOOKUP(H60,CoffeeBeans[],6,FALSE),\"\")","v":""},{"$f":"IFERROR(VLOOKUP(G60,CoffeeBeans[],2,FALSE),\"\")","v":""},{"$f":"IFERROR(VLOOKUP(H60,CoffeeBeans[],2,FALSE),\"\")","v":""}]
["","",null,"",null,"","","",{"$f":"IFERROR(VLOOKUP(G61,CoffeeBeans[],3,FALSE),\"\")","v":""},{"$f":"IFERROR(VLOOKUP(H61,CoffeeBeans[],3,FALSE),\"\")","v":""},{"$f":"IFERROR(VLOOKUP(G61,CoffeeBeans[],4,FALSE),\"\")","v":""},{"$f":"IFERROR(VLOOKUP(H61,CoffeeBeans[],4,FALSE),\"\")","v":""},{"$f":"IFERROR(VLOOKUP(G61,CoffeeBeans[],6,FALSE),\"\")","v":""},{"$f":"IFERROR(VLOOKUP(H61,CoffeeBeans[],6,FALSE),\"\")","v":""},{"$f":"IFERROR(VLOOKUP(G61,CoffeeBeans[],2,FALSE),\"\")","v":""},{"$f":"IFERROR(VLOOKUP(H61,CoffeeBeans[],2,FALSE),\"\")","v":""}]
["","",null,"",null,"","","",{"$f":"IFERROR(VLOOKUP(G62,CoffeeBeans[],3,FALSE),\"\")","v":""},{"$f":"IFERROR(VLOOKUP(H62,CoffeeBeans[],3,FALSE),\"\")","v":""},{"$f":"IFERROR(VLOOKUP(G62,CoffeeBeans[],4,FALSE),\"\")","v":""},{"$f":"IFERROR(VLOOKUP(H62,CoffeeBeans[],4,FALSE),\"\")","v":""},{"$f":"IFERROR(VLOOKUP(G62,CoffeeBeans[],6,FALSE),\"\")","v":""},{"$f":"IFERROR(VLOOKUP(H62,CoffeeBeans[],6,FALSE),\"\")","v":""},{"$f":"IFERROR(VLOOKUP(G62,CoffeeBeans[],2,FALSE),\"\")","v":""},{"$f":"IFERROR(VLOOKUP(H62,CoffeeBeans[],2,FALSE),\"\")","v":""}]
["","",null,"",null,"","","",{"$f":"IFERROR(VLOOKUP(G63,CoffeeBeans[],3,FALSE),\"\")","v":""},{"$f":"IFERROR(VLOOKUP(H63,CoffeeBeans[],3,FALSE),\"\")","v":""},{"$f":"IFERROR(VLOOKUP(G63,CoffeeBeans[],4,FALSE),\"\")","v":""},{"$f":"IFERROR(VLOOKUP(H63,CoffeeBeans[],4,FALSE),\"\")","v":""},{"$f":"IFERROR(VLOOKUP(G63,CoffeeBeans[],6,FALSE),\"\")","v":""},{"$f":"IFERROR(VLOOKUP(H63,CoffeeBeans[],6,FALSE),\"\")","v":""},{"$f":"IFERROR(VLOOKUP(G63,CoffeeBeans[],2,FALSE),\"\")","v":""},{"$f":"IFERROR(VLOOKUP(H63,CoffeeBeans[],2,FALSE),\"\")","v":""}]
["","",null,"",null,"","","",{"$f":"IFERROR(VLOOKUP(G64,CoffeeBeans[],3,FALSE),\"\")","v":""},{"$f":"IFERROR(VLOOKUP(H64,CoffeeBeans[],3,FALSE),\"\")","v":""},{"$f":"IFERROR(VLOOKUP(G64,CoffeeBeans[],4,FALSE),\"\")","v":""},{"$f":"IFERROR(VLOOKUP(H64,CoffeeBeans[],4,FALSE),\"\")","v":""},{"$f":"IFERROR(VLOOKUP(G64,CoffeeBeans[],6,FALSE),\"\")","v":""},{"$f":"IFERROR(VLOOKUP(H64,CoffeeBeans[],6,FALSE),\"\")","v":""},{"$f":"IFERROR(VLOOKUP(G64,CoffeeBeans[],2,FALSE),\"\")","v":""},{"$f":"IFERROR(VLOOKUP(H64,CoffeeBeans[],2,FALSE),\"\")","v":""}]
["","",null,"",null,"","","",{"$f":"IFERROR(VLOOKUP(G65,CoffeeBeans[],3,FALSE),\"\")","v":""},{"$f":"IFERROR(VLOOKUP(H65,CoffeeBeans[],3,FALSE),\"\")","v":""},{"$f":"IFERROR(VLOOKUP(G65,CoffeeBeans[],4,FALSE),\"\")","v":""},{"$f":"IFERROR(VLOOKUP(H65,CoffeeBeans[],4,FALSE),\"\")","v":""},{"$f":"IFERROR(VLOOKUP(G65,CoffeeBeans[],6,FALSE),\"\")","v":""},{"$f":"IFERROR(VLOOKUP(H65,CoffeeBeans[],6,FALSE),\"\")","v":""},{"$f":"IFERROR(VLOOKUP(G65,CoffeeBeans[],2,FALSE),\"\")","v":""},{"$f":"IFERROR(VLOOKUP(H65,CoffeeBeans[],2,FALSE),\"\")","v":""}]
["","",null,{"$f":"IF(ISNUMBER(A66),COUNTIF(G:G,C66)+COUNTIF(H:H,C66),\"\")","v":""},null,{"$f":"IF(F65=\"Pair\",1,IF(ISNUMBER(F65),IF(F65+1>$E$3/2,\"\",F65+1),\"\"))","v":""},{"$f":"IF(ISNUMBER(F66),VLOOKUP(F66,Participants2,2,FALSE),\"\")","v":""},{"$f":"IF(ISNUMBER(F66),VLOOKUP($E$3+1-F66,Participants2,2,FALSE),\"\")","v":""},{"$f":"IFERROR(VLOOKUP(G66,CoffeeBeans[],3,FALSE),\"\")","v":""},{"$f":"IFERROR(VLOOKUP(H66,CoffeeBeans[],3,FALSE),\"\")","v":""},{"$f":"IFERROR(VLOOKUP(G66,CoffeeBeans[],4,FALSE),\"\")","v":""},{"$f":"IFERROR(VLOOKUP(H66,CoffeeBeans[],4,FALSE),\"\")","v":""},{"$f":"IFERROR(VLOOKUP(G66,CoffeeBeans[],6,FALSE),\"\")","v":""},{"$f":"IFERROR(VLOOKUP(H66,CoffeeBeans[],6,FALSE),\"\")","v":""},{"$f":"IFERROR(VLOOKUP(G66,CoffeeBeans[],2,FALSE),\"\")","v":""},{"$f":"IFERROR(VLOOKUP(H66,CoffeeBeans[],2,FALSE),\"\")","v":""}]
[{"$f":"IF(ISBLANK(C67),\"\",RAND())","v":""},{"$f":"IFERROR(_xlfn.RANK.AVG(A67,$A$2:$A$1001,0),\"\")","v":""},null,"",null,"","","",{"$f":"IFERROR(VLOOKUP(G67,CoffeeBeans[],3,FALSE),\"\")","v":""},{"$f":"IFERROR(VLOOKUP(H67,CoffeeBeans[],3,FALSE),\"\")","v":""},{"$f":"IFERROR(VLOOKUP(G67,CoffeeBeans[],4,FALSE),\"\")","v":""},{"$f":"IFERROR(VLOOKUP(H67,CoffeeBeans[],4,FALSE),\"\")","v":""},{"$f":"IFERROR(VLOOKUP(G67,CoffeeBeans[],6,FALSE),\"\")","v":""},{"$f":"IFERROR(VLOOKUP(H67,CoffeeBeans[],6,FALSE),\"\")","v":""},{"$f":"IFERROR(VLOOKUP(G67,CoffeeBeans[],2,FALSE),\"\")","v":""},{"$f":"IFERROR(VLOOKUP(H67,CoffeeBeans[],2,FALSE),\"\")","v":""}]
["","",null,"",null,"","","",{"$f":"IFERROR(VLOOKUP(G68,CoffeeBeans[],3,FALSE),\"\")","v":""},{"$f":"IFERROR(VLOOKUP(H68,CoffeeBeans[],3,FALSE),\"\")","v":""},{"$f":"IFERROR(VLOOKUP(G68,CoffeeBeans[],4,FALSE),\"\")","v":""},{"$f":"IFERROR(VLOOKUP(H68,CoffeeBeans[],4,FALSE),\"\")","v":""},{"$f":"IFERROR(VLOOKUP(G68,CoffeeBeans[],6,FALSE),\"\")","v":""},{"$f":"IFERROR(VLOOKUP(H68,CoffeeBeans[],6,FALSE),\"\")","v":""},{"$f":"IFERROR(VLOOKUP(G68,CoffeeBeans[],2,FALSE),\"\")","v":""},{"$f":"IFERROR(VLOOKUP(H68,CoffeeBeans[],2,FALSE),\"\")","v":""}]
["","",null,"",null,"","","",{"$f":"IFERROR(VLOOKUP(G69,CoffeeBeans[],3,FALSE),\"\")","v":""},{"$f":"IFERROR(VLOOKUP(H69,CoffeeBeans[],3,FALSE),\"\")","v":""},{"$f":"IFERROR(VLOOKUP(G69,CoffeeBeans[],4,FALSE),\"\")","v":""},{"$f":"IFERROR(VLOOKUP(H69,CoffeeBeans[],4,FALSE),\"\")","v":""},{"$f":"IFERROR(VLOOKUP(G69,CoffeeBeans[],6,FALSE),\"\")","v":""},{"$f":"IFERROR(VLOOKUP(H69,CoffeeBeans[],6,FALSE),\"\")","v":""},{"$f":"IFERROR(VLOOKUP(G69,CoffeeBeans[],2,FALSE),\"\")","v":""},{"$f":"IFERROR(VLOOKUP(H69,CoffeeBeans[],2,FALSE),\"\")","v":""}]
["","",null,"",null,"","","",{"$f":"IFERROR(VLOOKUP(G70,CoffeeBeans[],3,FALSE),\"\")","v":""},{"$f":"IFERROR(VLOOKUP(H70,CoffeeBeans[],3,FALSE),\"\")","v":""},{"$f":"IFERROR(VLOOKUP(G70,CoffeeBeans[],4,FALSE),\"\")","v":""},{"$f":"IFERROR(VLOOKUP(H70,CoffeeBeans[],4,FALSE),\"\")","v":""},{"$f":"IFERROR(VLOOKUP(G70,CoffeeBeans[],6,FALSE),\"\")","v":""},{"$f":"IFERROR(VLOOKUP(H70,CoffeeBeans[],6,FALSE),\"\")","v":""},{"$f":"IFERROR(VLOOKUP(G70,CoffeeBeans[],2,FALSE),\"\")","v":""},{"$f":"IFERROR(VLOOKUP(H70,CoffeeBeans[],2,FALSE),\"\")","v":""}]
["","",null,"",null,"","","",{"$f":"IFERROR(VLOOKUP(G71,CoffeeBeans[],3,FALSE),\"\")","v":""},{"$f":"IFERROR(VLOOKUP(H71,CoffeeBeans[],3,FALSE),\"\")","v":""},{"$f":"IFERROR(VLOOKUP(G71,CoffeeBeans[],4,FALSE),\"\")","v":""},{"$f":"IFERROR(VLOOKUP(H71,CoffeeBeans[],4,FALSE),\"\")","v":""},{"$f":"IFERROR(VLOOKUP(G71,CoffeeBeans[],6,FALSE),\"\")","v":""},{"$f":"IFERROR(VLOOKUP(H71,CoffeeBeans[],6,FALSE),\"\")","v":""},{"$f":"IFERROR(VLOOKUP(G71,CoffeeBeans[],2,FALSE),\"\")","v":""},{"$f":"IFERROR(VLOOKUP(H71,CoffeeBeans[],2,FALSE),\"\")","v":""}]
["","",null,"",null,"","","",{"$f":"IFERROR(VLOOKUP(G72,CoffeeBeans[],3,FALSE),\"\")","v":""},{"$f":"IFERROR(VLOOKUP(H72,CoffeeBeans[],3,FALSE),\"\")","v":""},{"$f":"IFERROR(VLOOKUP(G72,CoffeeBeans[],4,FALSE),\"\")","v":""},{"$f":"IFERROR(VLOOKUP(H72,CoffeeBeans[],4,FALSE),\"\")","v":""},{"$f":"IFERROR(VLOOKUP(G72,CoffeeBeans[],6,FALSE),\"\")","v":""},{"$f":"IFERROR(VLOOKUP(H72,CoffeeBeans[],6,FALSE),\"\")","v":""},{"$f":"IFERROR(VLOOKUP(G72,CoffeeBeans[],2,FALSE),\"\")","v":""},{"$f":"IFERROR(VLOOKUP(H72,CoffeeBeans[],2,FALSE),\"\")","v":""}]
["","",null,"",null,"","","",{"$f":"IFERROR(VLOOKUP(G73,CoffeeBeans[],3,FALSE),\"\")","v":""},{"$f":"IFERROR(VLOOKUP(H73,CoffeeBeans[],3,FALSE),\"\")","v":""},{"$f":"IFERROR(VLOOKUP(G73,CoffeeBeans[],4,FALSE),\"\")","v":""},{"$f":"IFERROR(VLOOKUP(H73,CoffeeBeans[],4,FALSE),\"\")","v":""},{"$f":"IFERROR(VLOOKUP(G73,CoffeeBeans[],6,FALSE),\"\")","v":""},{"$f":"IFERROR(VLOOKUP(H73,CoffeeBeans[],6,FALSE),\"\")","v":""},{"$f":"IFERROR(VLOOKUP(G73,CoffeeBeans[],2,FALSE),\"\")","v":""},{"$f":"IFERROR(VLOOKUP(H73,CoffeeBeans[],2,FALSE),\"\")","v":""}]
["","",null,"",null,"","","",{"$f":"IFERROR(VLOOKUP(G74,CoffeeBeans[],3,FALSE),\"\")","v":""},{"$f":"IFERROR(VLOOKUP(H74,CoffeeBeans[],3,FALSE),\"\")","v":""},{"$f":"IFERROR(VLOOKUP(G74,CoffeeBeans[],4,FALSE),\"\")","v":""},{"$f":"IFERROR(VLOOKUP(H74,CoffeeBeans[],4,FALSE),\"\")","v":""},{"$f":"IFERROR(VLOOKUP(G74,CoffeeBeans[],6,FALSE),\"\")","v":""},{"$f":"IFERROR(VLOOKUP(H74,CoffeeBeans[],6,FALSE),\"\")","v":""},{"$f":"IFERROR(VLOOKUP(G74,CoffeeBeans[],2,FALSE),\"\")","v":""},{"$f":"IFERROR(VLOOKUP(H74,CoffeeBeans[],2,FALSE),\"\")","v":""}]
["","",null,"",null,"","","",{"$f":"IFERROR(VLOOKUP(G75,CoffeeBeans[],3,FALSE),\"\")","v":""},{"$f":"IFERROR(VLOOKUP(H75,CoffeeBeans[],3,FALSE),\"\")","v":""},{"$f":"IFERROR(VLOOKUP(G75,CoffeeBeans[],4,FALSE),\"\")","v":""},{"$f":"IFERROR(VLOOKUP(H75,CoffeeBeans[],4,FALSE),\"\")","v":""},{"$f":"IFERROR(VLOOKUP(G75,CoffeeBeans[],6,FALSE),\"\")","v":""},{"$f":"IFERROR(VLOOKUP(H75,CoffeeBeans[],6,FALSE),\"\")","v":""},{"$f":"IFERROR(VLOOKUP(G75,CoffeeBeans[],2,FALSE),\"\")","v":""},{"$f":"IFERROR(VLOOKUP(H75,CoffeeBeans[],2,FALSE),\"\")","v":""}]
["","",null,"",null,"","","",{"$f":"IFERROR(VLOOKUP(G76,CoffeeBeans[],3,FALSE),\"\")","v":""},{"$f":"IFERROR(VLOOKUP(H76,CoffeeBeans[],3,FALSE),\"\")","v":""},{"$f":"IFERROR(VLOOKUP(G76,CoffeeBeans[],4,FALSE),\"\")","v":""},{"$f":"IFERROR(VLOOKUP(H76,CoffeeBeans[],4,FALSE),\"\")","v":""},{"$f":"IFERROR(VLOOKUP(G76,CoffeeBeans[],6,FALSE),\"\")","v":""},{"$f":"IFERROR(VLOOKUP(H76,CoffeeBeans[],6,FALSE),\"\")","v":""},{"$f":"IFERROR(VLOOKUP(G76,CoffeeBeans[],2,FALSE),\"\")","v":""},{"$f":"IFERROR(VLOOKUP(H76,CoffeeBeans[],2,FALSE),\"\")","v":""}]
["","",null,"",null,"","","",{"$f":"IFERROR(VLOOKUP(G77,CoffeeBeans[],3,FALSE),\"\")","v":""},{"$f":"IFERROR(VLOOKUP(H77,CoffeeBeans[],3,FALSE),\"\")","v":""},{"$f":"IFERROR(VLOOKUP(G77,CoffeeBeans[],4,FALSE),\"\")","v":""},{"$f":"IFERROR(VLOOKUP(H77,CoffeeBeans[],4,FALSE),\"\")","v":""},{"$f":"IFERROR(VLOOKUP(G77,CoffeeBeans[],6,FALSE),\"\")","v":""},{"$f":"IFERROR(VLOOKUP(H77,CoffeeBeans[],6,FALSE),\"\")","v":""},{"$f":"IFERROR(VLOOKUP(G77,CoffeeBeans[],2,FALSE),\"\")","v":""},{"$f":"IFERROR(VLOOKUP(H77,CoffeeBeans[],2,FALSE),\"\")","v":""}]
["","",null,"",null,"","","",{"$f":"IFERROR(VLOOKUP(G78,CoffeeBeans[],3,FALSE),\"\")","v":""},{"$f":"IFERROR(VLOOKUP(H78,CoffeeBeans[],3,FALSE),\"\")","v":""},{"$f":"IFERROR(VLOOKUP(G78,CoffeeBeans[],4,FALSE),\"\")","v":""},{"$f":"IFERROR(VLOOKUP(H78,CoffeeBeans[],4,FALSE),\"\")","v":""},{"$f":"IFERROR(VLOOKUP(G78,CoffeeBeans[],6,FALSE),\"\")","v":""},{"$f":"IFERROR(VLOOKUP(H78,CoffeeBeans[],6,FALSE),\"\")","v":""},{"$f":"IFERROR(VLOOKUP(G78,CoffeeBeans[],2,FALSE),\"\")","v":""},{"$f":"IFERROR(VLOOKUP(H78,CoffeeBeans[],2,FALSE),\"\")","v":""}]
["","",null,"",null,"","","",{"$f":"IFERROR(VLOOKUP(G79,CoffeeBeans[],3,FALSE),\"\")","v":""},{"$f":"IFERROR(VLOOKUP(H79,CoffeeBeans[],3,FALSE),\"\")","v":""},{"$f":"IFERROR(VLOOKUP(G79,CoffeeBeans[],4,FALSE),\"\")","v":""},{"$f":"IFERROR(VLOOKUP(H79,CoffeeBeans[],4,FALSE),\"\")","v":""},{"$f":"IFERROR(VLOOKUP(G79,CoffeeBeans[],6,FALSE),\"\")","v":""},{"$f":"IFERROR(VLOOKUP(H79,CoffeeBeans[],6,FALSE),\"\")","v":""},{"$f":"IFERROR(VLOOKUP(G79,CoffeeBeans[],2,FALSE),\"\")","v":""},{"$f":"IFERROR(VLOOKUP(H79,CoffeeBeans[],2,FALSE),\"\")","v":""}]
["","",null,"",null,"","","",{"$f":"IFERROR(VLOOKUP(G80,CoffeeBeans[],3,FALSE),\"\")","v":""},{"$f":"IFERROR(VLOOKUP(H80,CoffeeBeans[],3,FALSE),\"\")","v":""},{"$f":"IFERROR(VLOOKUP(G80,CoffeeBeans[],4,FALSE),\"\")","v":""},{"$f":"IFERROR(VLOOKUP(H80,CoffeeBeans[],4,FALSE),\"\")","v":""},{"$f":"IFERROR(VLOOKUP(G80,CoffeeBeans[],6,FALSE),\"\")","v":""},{"$f":"IFERROR(VLOOKUP(H80,CoffeeBeans[],6,FALSE),\"\")","v":""},{"$f":"IFERROR(VLOOKUP(G80,CoffeeBeans[],2,FALSE),\"\")","v":""},{"$f":"IFERROR(VLOOKUP(H80,CoffeeBeans[],2,FALSE),\"\")","v":""}]
["","",null,"",null,"","","",{"$f":"IFERROR(VLOOKUP(G81,CoffeeBeans[],3,FALSE),\"\")","v":""},{"$f":"IFERROR(VLOOKUP(H81,CoffeeBeans[],3,FALSE),\"\")","v":""},{"$f":"IFERROR(VLOOKUP(G81,CoffeeBeans[],4,FALSE),\"\")","v":""},{"$f":"IFERROR(VLOOKUP(H81,CoffeeBeans[],4,FALSE),\"\")","v":""},{"$f":"IFERROR(VLOOKUP(G81,CoffeeBeans[],6,FALSE),\"\")","v":""},{"$f":"IFERROR(VLOOKUP(H81,CoffeeBeans[],6,FALSE),\"\")","v":""},{"$f":"IFERROR(VLOOKUP(G81,CoffeeBeans[],2,FALSE),\"\")","v":""},{"$f":"IFERROR(VLOOKUP(H81,CoffeeBeans[],2,FALSE),\"\")","v":""}]
["","",null,"",null,"","","",{"$f":"IFERROR(VLOOKUP(G82,CoffeeBeans[],3,FALSE),\"\")","v":""},{"$f":"IFERROR(VLOOKUP(H82,CoffeeBeans[],3,FALSE),\"\")","v":""},{"$f":"IFERROR(VLOOKUP(G82,CoffeeBeans[],4,FALSE),\"\")","v":""},{"$f":"IFERROR(VLOOKUP(H82,CoffeeBeans[],4,FALSE),\"\")","v":""},{"$f":"IFERROR(VLOOKUP(G82,CoffeeBeans[],6,FALSE),\"\")","v":""},{"$f":"IFERROR(VLOOKUP(H82,CoffeeBeans[],6,FALSE),\"\")","v":""},{"$f":"IFERROR(VLOOKUP(G82,CoffeeBeans[],2,FALSE),\"\")","v":""},{"$f":"IFERROR(VLOOKUP(H82,CoffeeBeans[],2,FALSE),\"\")","v":""}]
["","",null,"",null,"","","",{"$f":"IFERROR(VLOOKUP(G83,CoffeeBeans[],3,FALSE),\"\")","v":""},{"$f":"IFERROR(VLOOKUP(H83,CoffeeBeans[],3,FALSE),\"\")","v":""},{"$f":"IFERROR(VLOOKUP(G83,CoffeeBeans[],4,FALSE),\"\")","v":""},{"$f":"IFERROR(VLOOKUP(H83,CoffeeBeans[],4,FALSE),\"\")","v":""},{"$f":"IFERROR(VLOOKUP(G83,CoffeeBeans[],6,FALSE),\"\")","v":""},{"$f":"IFERROR(VLOOKUP(H83,CoffeeBeans[],6,FALSE),\"\")","v":""},{"$f":"IFERROR(VLOOKUP(G83,CoffeeBeans[],2,FALSE),\"\")","v":""},{"$f":"IFERROR(VLOOKUP(H83,CoffeeBeans[],2,FALSE),\"\")","v":""}]
["","",null,"",null,"","","",{"$f":"IFERROR(VLOOKUP(G84,CoffeeBeans[],3,FALSE),\"\")","v":""},{"$f":"IFERROR(VLOOKUP(H84,CoffeeBeans[],3,FALSE),\"\")","v":""},{"$f":"IFERROR(VLOOKUP(G84,CoffeeBeans[],4,FALSE),\"\")","v":""},{"$f":"IFERROR(VLOOKUP(H84,CoffeeBeans[],4,FALSE),\"\")","v":""},{"$f":"IFERROR(VLOOKUP(G84,CoffeeBeans[],6,FALSE),\"\")","v":""},{"$f":"IFERROR(VLOOKUP(H84,CoffeeBeans[],6,FALSE),\"\")","v":""},{"$f":"IFERROR(VLOOKUP(G84,CoffeeBeans[],2,FALSE),\"\")","v":""},{"$f":"IFERROR(VLOOKUP(H84,CoffeeBeans[],2,FALSE),\"\")","v":""}]
["","",null,"",null,"","","",{"$f":"IFERROR(VLOOKUP(G85,CoffeeBeans[],3,FALSE),\"\")","v":""},{"$f":"IFERROR(VLOOKUP(H85,CoffeeBeans[],3,FALSE),\"\")","v":""},{"$f":"IFERROR(VLOOKUP(G85,CoffeeBeans[],4,FALSE),\"\")","v":""},{"$f":"IFERROR(VLOOKUP(H85,CoffeeBeans[],4,FALSE),\"\")","v":""},{"$f":"IFERROR(VLOOKUP(G85,CoffeeBeans[],6,FALSE),\"\")","v":""},{"$f":"IFERROR(VLOOKUP(H85,CoffeeBeans[],6,FALSE),\"\")","v":""},{"$f":"IFERROR(VLOOKUP(G85,CoffeeBeans[],2,FALSE),\"\")","v":""},{"$f":"IFERROR(VLOOKUP(H85,CoffeeBeans[],2,FALSE),\"\")","v":""}]
["","",null,"",null,"","","",{"$f":"IFERROR(VLOOKUP(G86,CoffeeBeans[],3,FALSE),\"\")","v":""},{"$f":"IFERROR(VLOOKUP(H86,CoffeeBeans[],3,FALSE),\"\")","v":""},{"$f":"IFERROR(VLOOKUP(G86,CoffeeBeans[],4,FALSE),\"\")","v":""},{"$f":"IFERROR(VLOOKUP(H86,CoffeeBeans[],4,FALSE),\"\")","v":""},{"$f":"IFERROR(VLOOKUP(G86,CoffeeBeans[],6,FALSE),\"\")","v":""},{"$f":"IFERROR(VLOOKUP(H86,CoffeeBeans[],6,FALSE),\"\")","v":""},{"$f":"IFERROR(VLOOKUP(G86,CoffeeBeans[],2,FALSE),\"\")","v":""},{"$f":"IFERROR(VLOOKUP(H86,CoffeeBeans[],2,FALSE),\"\")","v":""}]
["","",null,"",null,"","","",{"$f":"IFERROR(VLOOKUP(G87,CoffeeBeans[],3,FALSE),\"\")","v":""},{"$f":"IFERROR(VLOOKUP(H87,CoffeeBeans[],3,FALSE),\"\")","v":""},{"$f":"IFERROR(VLOOKUP(G87,CoffeeBeans[],4,FALSE),\"\")","v":""},{"$f":"IFERROR(VLOOKUP(H87,CoffeeBeans[],4,FALSE),\"\")","v":""},{"$f":"IFERROR(VLOOKUP(G87,CoffeeBeans[],6,FALSE),\"\")","v":""},{"$f":"IFERROR(VLOOKUP(H87,CoffeeBeans[],6,FALSE),\"\")","v":""},{"$f":"IFERROR(VLOOKUP(G87,CoffeeBeans[],2,FALSE),\"\")","v":""},{"$f":"IFERROR(VLOOKUP(H87,CoffeeBeans[],2,FALSE),\"\")","v":""}]
["","",null,"",null,"","","",{"$f":"IFERROR(VLOOKUP(G88,CoffeeBeans[],3,FALSE),\"\")","v":""},{"$f":"IFERROR(VLOOKUP(H88,CoffeeBeans[],3,FALSE),\"\")","v":""},{"$f":"IFERROR(VLOOKUP(G88,CoffeeBeans[],4,FALSE),\"\")","v":""},{"$f":"IFERROR(VLOOKUP(H88,CoffeeBeans[],4,FALSE),\"\")","v":""},{"$f":"IFERROR(VLOOKUP(G88,CoffeeBeans[],6,FALSE),\"\")","v":""},{"$f":"IFERROR(VLOOKUP(H88,CoffeeBeans[],6,FALSE),\"\")","v":""},{"$f":"IFERROR(VLOOKUP(G88,CoffeeBeans[],2,FALSE),\"\")","v":""},{"$f":"IFERROR(VLOOKUP(H88,CoffeeBeans[],2,FALSE),\"\")","v":""}]
["","",null,"",null,"","","",{"$f":"IFERROR(VLOOKUP(G89,CoffeeBeans[],3,FALSE),\"\")","v":""},{"$f":"IFERROR(VLOOKUP(H89,CoffeeBeans[],3,FALSE),\"\")","v":""},{"$f":"IFERROR(VLOOKUP(G89,CoffeeBeans[],4,FALSE),\"\")","v":""},{"$f":"IFERROR(VLOOKUP(H89,CoffeeBeans[],4,FALSE),\"\")","v":""},{"$f":"IFERROR(VLOOKUP(G89,CoffeeBeans[],6,FALSE),\"\")","v":""},{"$f":"IFERROR(VLOOKUP(H89,CoffeeBeans[],6,FALSE),\"\")","v":""},{"$f":"IFERROR(VLOOKUP(G89,CoffeeBeans[],2,FALSE),\"\")","v":""},{"$f":"IFERROR(VLOOKUP(H89,CoffeeBeans[],2,FALSE),\"\")","v":""}]
["","",null,"",null,"","","",{"$f":"IFERROR(VLOOKUP(G90,CoffeeBeans[],3,FALSE),\"\")","v":""},{"$f":"IFERROR(VLOOKUP(H90,CoffeeBeans[],3,FALSE),\"\")","v":""},{"$f":"IFERROR(VLOOKUP(G90,CoffeeBeans[],4,FALSE),\"\")","v":""},{"$f":"IFERROR(VLOOKUP(H90,CoffeeBeans[],4,FALSE),\"\")","v":""},{"$f":"IFERROR(VLOOKUP(G90,CoffeeBeans[],6,FALSE),\"\")","v":""},{"$f":"IFERROR(VLOOKUP(H90,CoffeeBeans[],6,FALSE),\"\")","v":""},{"$f":"IFERROR(VLOOKUP(G90,CoffeeBeans[],2,FALSE),\"\")","v":""},{"$f":"IFERROR(VLOOKUP(H90,CoffeeBeans[],2,FALSE),\"\")","v":""}]
["","",null,"",null,"","","",{"$f":"IFERROR(VLOOKUP(G91,CoffeeBeans[],3,FALSE),\"\")","v":""},{"$f":"IFERROR(VLOOKUP(H91,CoffeeBeans[],3,FALSE),\"\")","v":""},{"$f":"IFERROR(VLOOKUP(G91,CoffeeBeans[],4,FALSE),\"\")","v":""},{"$f":"IFERROR(VLOOKUP(H91,CoffeeBeans[],4,FALSE),\"\")","v":""},{"$f":"IFERROR(VLOOKUP(G91,CoffeeBeans[],6,FALSE),\"\")","v":""},{"$f":"IFERROR(VLOOKUP(H91,CoffeeBeans[],6,FALSE),\"\")","v":""},{"$f":"IFERROR(VLOOKUP(G91,CoffeeBeans[],2,FALSE),\"\")","v":""},{"$f":"IFERROR(VLOOKUP(H91,CoffeeBeans[],2,FALSE),\"\")","v":""}]
["","",null,"",null,"","","",{"$f":"IFERROR(VLOOKUP(G92,CoffeeBeans[],3,FALSE),\"\")","v":""},{"$f":"IFERROR(VLOOKUP(H92,CoffeeBeans[],3,FALSE),\"\")","v":""},{"$f":"IFERROR(VLOOKUP(G92,CoffeeBeans[],4,FALSE),\"\")","v":""},{"$f":"IFERROR(VLOOKUP(H92,CoffeeBeans[],4,FALSE),\"\")","v":""},{"$f":"IFERROR(VLOOKUP(G92,CoffeeBeans[],6,FALSE),\"\")","v":""},{"$f":"IFERROR(VLOOKUP(H92,CoffeeBeans[],6,FALSE),\"\")","v":""},{"$f":"IFERROR(VLOOKUP(G92,CoffeeBeans[],2,FALSE),\"\")","v":""},{"$f":"IFERROR(VLOOKUP(H92,CoffeeBeans[],2,FALSE),\"\")","v":""}]
["","",null,"",null,"","","",{"$f":"IFERROR(VLOOKUP(G93,CoffeeBeans[],3,FALSE),\"\")","v":""},{"$f":"IFERROR(VLOOKUP(H93,CoffeeBeans[],3,FALSE),\"\")","v":""},{"$f":"IFERROR(VLOOKUP(G93,CoffeeBeans[],4,FALSE),\"\")","v":""},{"$f":"IFERROR(VLOOKUP(H93,CoffeeBeans[],4,FALSE),\"\")","v":""},{"$f":"IFERROR(VLOOKUP(G93,CoffeeBeans[],6,FALSE),\"\")","v":""},{"$f":"IFERROR(VLOOKUP(H93,CoffeeBeans[],6,FALSE),\"\")","v":""},{"$f":"IFERROR(VLOOKUP(G93,CoffeeBeans[],2,FALSE),\"\")","v":""},{"$f":"IFERROR(VLOOKUP(H93,CoffeeBeans[],2,FALSE),\"\")","v":""}]
["","",null,"",null,"","","",{"$f":"IFERROR(VLOOKUP(G94,CoffeeBeans[],3,FALSE),\"\")","v":""},{"$f":"IFERROR(VLOOKUP(H94,CoffeeBeans[],3,FALSE),\"\")","v":""},{"$f":"IFERROR(VLOOKUP(G94,CoffeeBeans[],4,FALSE),\"\")","v":""},{"$f":"IFERROR(VLOOKUP(H94,CoffeeBeans[],4,FALSE),\"\")","v":""},{"$f":"IFERROR(VLOOKUP(G94,CoffeeBeans[],6,FALSE),\"\")","v":""},{"$f":"IFERROR(VLOOKUP(H94,CoffeeBeans[],6,FALSE),\"\")","v":""},{"$f":"IFERROR(VLOOKUP(G94,CoffeeBeans[],2,FALSE),\"\")","v":""},{"$f":"IFERROR(VLOOKUP(H94,CoffeeBeans[],2,FALSE),\"\")","v":""}]
["","",null,"",null,"","","",{"$f":"IFERROR(VLOOKUP(G95,CoffeeBeans[],3,FALSE),\"\")","v":""},{"$f":"IFERROR(VLOOKUP(H95,CoffeeBeans[],3,FALSE),\"\")","v":""},{"$f":"IFERROR(VLOOKUP(G95,CoffeeBeans[],4,FALSE),\"\")","v":""},{"$f":"IFERROR(VLOOKUP(H95,CoffeeBeans[],4,FALSE),\"\")","v":""},{"$f":"IFERROR(VLOOKUP(G95,CoffeeBeans[],6,FALSE),\"\")","v":""},{"$f":"IFERROR(VLOOKUP(H95,CoffeeBeans[],6,FALSE),\"\")","v":""},{"$f":"IFERROR(VLOOKUP(G95,CoffeeBeans[],2,FALSE),\"\")","v":""},{"$f":"IFERROR(VLOOKUP(H95,CoffeeBeans[],2,FALSE),\"\")","v":""}]
["","",null,"",null,"","","",{"$f":"IFERROR(VLOOKUP(G96,CoffeeBeans[],3,FALSE),\"\")","v":""},{"$f":"IFERROR(VLOOKUP(H96,CoffeeBeans[],3,FALSE),\"\")","v":""},{"$f":"IFERROR(VLOOKUP(G96,CoffeeBeans[],4,FALSE),\"\")","v":""},{"$f":"IFERROR(VLOOKUP(H96,CoffeeBeans[],4,FALSE),\"\")","v":""},{"$f":"IFERROR(VLOOKUP(G96,CoffeeBeans[],6,FALSE),\"\")","v":""},{"$f":"IFERROR(VLOOKUP(H96,CoffeeBeans[],6,FALSE),\"\")","v":""},{"$f":"IFERROR(VLOOKUP(G96,CoffeeBeans[],2,FALSE),\"\")","v":""},{"$f":"IFERROR(VLOOKUP(H96,CoffeeBeans[],2,FALSE),\"\")","v":""}]
["","",null,"",null,"","","",{"$f":"IFERROR(VLOOKUP(G97,CoffeeBeans[],3,FALSE),\"\")","v":""},{"$f":"IFERROR(VLOOKUP(H97,CoffeeBeans[],3,FALSE),\"\")","v":""},{"$f":"IFERROR(VLOOKUP(G97,CoffeeBeans[],4,FALSE),\"\")","v":""},{"$f":"IFERROR(VLOOKUP(H97,CoffeeBeans[],4,FALSE),\"\")","v":""},{"$f":"IFERROR(VLOOKUP(G97,CoffeeBeans[],6,FALSE),\"\")","v":""},{"$f":"IFERROR(VLOOKUP(H97,CoffeeBeans[],6,FALSE),\"\")","v":""},{"$f":"IFERROR(VLOOKUP(G97,CoffeeBeans[],2,FALSE),\"\")","v":""},{"$f":"IFERROR(VLOOKUP(H97,CoffeeBeans[],2,FALSE),\"\")","v":""}]
["","",null,"",null,"","","",{"$f":"IFERROR(VLOOKUP(G98,CoffeeBeans[],3,FALSE),\"\")","v":""},{"$f":"IFERROR(VLOOKUP(H98,CoffeeBeans[],3,FALSE),\"\")","v":""},{"$f":"IFERROR(VLOOKUP(G98,CoffeeBeans[],4,FALSE),\"\")","v":""},{"$f":"IFERROR(VLOOKUP(H98,CoffeeBeans[],4,FALSE),\"\")","v":""},{"$f":"IFERROR(VLOOKUP(G98,CoffeeBeans[],6,FALSE),\"\")","v":""},{"$f":"IFERROR(VLOOKUP(H98,CoffeeBeans[],6,FALSE),\"\")","v":""},{"$f":"IFERROR(VLOOKUP(G98,CoffeeBeans[],2,FALSE),\"\")","v":""},{"$f":"IFERROR(VLOOKUP(H98,CoffeeBeans[],2,FALSE),\"\")","v":""}]
["","",null,"",null,"","","",{"$f":"IFERROR(VLOOKUP(G99,CoffeeBeans[],3,FALSE),\"\")","v":""},{"$f":"IFERROR(VLOOKUP(H99,CoffeeBeans[],3,FALSE),\"\")","v":""},{"$f":"IFERROR(VLOOKUP(G99,CoffeeBeans[],4,FALSE),\"\")","v":""},{"$f":"IFERROR(VLOOKUP(H99,CoffeeBeans[],4,FALSE),\"\")","v":""},{"$f":"IFERROR(VLOOKUP(G99,CoffeeBeans[],6,FALSE),\"\")","v":""},{"$f":"IFERROR(VLOOKUP(H99,CoffeeBeans[],6,FALSE),\"\")","v":""},{"$f":"IFERROR(VLOOKUP(G99,CoffeeBeans[],2,FALSE),\"\")","v":""},{"$f":"IFERROR(VLOOKUP(H99,CoffeeBeans[],2,FALSE),\"\")","v":""}]
["","",null,"",null,"","","",{"$f":"IFERROR(VLOOKUP(G100,CoffeeBeans[],3,FALSE),\"\")","v":""},{"$f":"IFERROR(VLOOKUP(H100,CoffeeBeans[],3,FALSE),\"\")","v":""},{"$f":"IFERROR(VLOOKUP(G100,CoffeeBeans[],4,FALSE),\"\")","v":""},{"$f":"IFERROR(VLOOKUP(H100,CoffeeBeans[],4,FALSE),\"\")","v":""},{"$f":"IFERROR(VLOOKUP(G100,CoffeeBeans[],6,FALSE),\"\")","v":""},{"$f":"IFERROR(VLOOKUP(H100,CoffeeBeans[],6,FALSE),\"\")","v":""},{"$f":"IFERROR(VLOOKUP(G100,CoffeeBeans[],2,FALSE),\"\")","v":""},{"$f":"IFERROR(VLOOKUP(H100,CoffeeBeans[],2,FALSE),\"\")","v":""}]
["","",null,"",null,"","","",{"$f":"IFERROR(VLOOKUP(G101,CoffeeBeans[],3,FALSE),\"\")","v":""},{"$f":"IFERROR(VLOOKUP(H101,CoffeeBeans[],3,FALSE),\"\")","v":""},{"$f":"IFERROR(VLOOKUP(G101,CoffeeBeans[],4,FALSE),\"\")","v":""},{"$f":"IFERROR(VLOOKUP(H101,CoffeeBeans[],4,FALSE),\"\")","v":""},{"$f":"IFERROR(VLOOKUP(G101,CoffeeBeans[],6,FALSE),\"\")","v":""},{"$f":"IFERROR(VLOOKUP(H101,CoffeeBeans[],6,FALSE),\"\")","v":""},{"$f":"IFERROR(VLOOKUP(G101,CoffeeBeans[],2,FALSE),\"\")","v":""},{"$f":"IFERROR(VLOOKUP(H101,CoffeeBeans[],2,FALSE),\"\")","v":""}]
["","",null,"",null,"","","",{"$f":"IFERROR(VLOOKUP(G102,CoffeeBeans[],3,FALSE),\"\")","v":""},{"$f":"IFERROR(VLOOKUP(H102,CoffeeBeans[],3,FALSE),\"\")","v":""},{"$f":"IFERROR(VLOOKUP(G102,CoffeeBeans[],4,FALSE),\"\")","v":""},{"$f":"IFERROR(VLOOKUP(H102,CoffeeBeans[],4,FALSE),\"\")","v":""},{"$f":"IFERROR(VLOOKUP(G102,CoffeeBeans[],6,FALSE),\"\")","v":""},{"$f":"IFERROR(VLOOKUP(H102,CoffeeBeans[],6,FALSE),\"\")","v":""},{"$f":"IFERROR(VLOOKUP(G102,CoffeeBeans[],2,FALSE),\"\")","v":""},{"$f":"IFERROR(VLOOKUP(H102,CoffeeBeans[],2,FALSE),\"\")","v":""}]
["","",null,"",null,"","","",{"$f":"IFERROR(VLOOKUP(G103,CoffeeBeans[],3,FALSE),\"\")","v":""},{"$f":"IFERROR(VLOOKUP(H103,CoffeeBeans[],3,FALSE),\"\")","v":""},{"$f":"IFERROR(VLOOKUP(G103,CoffeeBeans[],4,FALSE),\"\")","v":""},{"$f":"IFERROR(VLOOKUP(H103,CoffeeBeans[],4,FALSE),\"\")","v":""},{"$f":"IFERROR(VLOOKUP(G103,CoffeeBeans[],6,FALSE),\"\")","v":""},{"$f":"IFERROR(VLOOKUP(H103,CoffeeBeans[],6,FALSE),\"\")","v":""},{"$f":"IFERROR(VLOOKUP(G103,CoffeeBeans[],2,FALSE),\"\")","v":""},{"$f":"IFERROR(VLOOKUP(H103,CoffeeBeans[],2,FALSE),\"\")","v":""}]
["","",null,"",null,"","","",{"$f":"IFERROR(VLOOKUP(G104,CoffeeBeans[],3,FALSE),\"\")","v":""},{"$f":"IFERROR(VLOOKUP(H104,CoffeeBeans[],3,FALSE),\"\")","v":""},{"$f":"IFERROR(VLOOKUP(G104,CoffeeBeans[],4,FALSE),\"\")","v":""},{"$f":"IFERROR(VLOOKUP(H104,CoffeeBeans[],4,FALSE),\"\")","v":""},{"$f":"IFERROR(VLOOKUP(G104,CoffeeBeans[],6,FALSE),\"\")","v":""},{"$f":"IFERROR(VLOOKUP(H104,CoffeeBeans[],6,FALSE),\"\")","v":""},{"$f":"IFERROR(VLOOKUP(G104,CoffeeBeans[],2,FALSE),\"\")","v":""},{"$f":"IFERROR(VLOOKUP(H104,CoffeeBeans[],2,FALSE),\"\")","v":""}]
["","",null,"",null,"","","",{"$f":"IFERROR(VLOOKUP(G105,CoffeeBeans[],3,FALSE),\"\")","v":""},{"$f":"IFERROR(VLOOKUP(H105,CoffeeBeans[],3,FALSE),\"\")","v":""},{"$f":"IFERROR(VLOOKUP(G105,CoffeeBeans[],4,FALSE),\"\")","v":""},{"$f":"IFERROR(VLOOKUP(H105,CoffeeBeans[],4,FALSE),\"\")","v":""},{"$f":"IFERROR(VLOOKUP(G105,CoffeeBeans[],6,FALSE),\"\")","v":""},{"$f":"IFERROR(VLOOKUP(H105,CoffeeBeans[],6,FALSE),\"\")","v":""},{"$f":"IFERROR(VLOOKUP(G105,CoffeeBeans[],2,FALSE),\"\")","v":""},{"$f":"IFERROR(VLOOKUP(H105,CoffeeBeans[],2,FALSE),\"\")","v":""}]
["","",null,"",null,"","","",{"$f":"IFERROR(VLOOKUP(G106,CoffeeBeans[],3,FALSE),\"\")","v":""},{"$f":"IFERROR(VLOOKUP(H106,CoffeeBeans[],3,FALSE),\"\")","v":""},{"$f":"IFERROR(VLOOKUP(G106,CoffeeBeans[],4,FALSE),\"\")","v":""},{"$f":"IFERROR(VLOOKUP(H106,CoffeeBeans[],4,FALSE),\"\")","v":""},{"$f":"IFERROR(VLOOKUP(G106,CoffeeBeans[],6,FALSE),\"\")","v":""},{"$f":"IFERROR(VLOOKUP(H106,CoffeeBeans[],6,FALSE),\"\")","v":""},{"$f":"IFERROR(VLOOKUP(G106,CoffeeBeans[],2,FALSE),\"\")","v":""},{"$f":"IFERROR(VLOOKUP(H106,CoffeeBeans[],2,FALSE),\"\")","v":""}]
["","",null,"",null,"","","",{"$f":"IFERROR(VLOOKUP(G107,CoffeeBeans[],3,FALSE),\"\")","v":""},{"$f":"IFERROR(VLOOKUP(H107,CoffeeBeans[],3,FALSE),\"\")","v":""},{"$f":"IFERROR(VLOOKUP(G107,CoffeeBeans[],4,FALSE),\"\")","v":""},{"$f":"IFERROR(VLOOKUP(H107,CoffeeBeans[],4,FALSE),\"\")","v":""},{"$f":"IFERROR(VLOOKUP(G107,CoffeeBeans[],6,FALSE),\"\")","v":""},{"$f":"IFERROR(VLOOKUP(H107,CoffeeBeans[],6,FALSE),\"\")","v":""},{"$f":"IFERROR(VLOOKUP(G107,CoffeeBeans[],2,FALSE),\"\")","v":""},{"$f":"IFERROR(VLOOKUP(H107,CoffeeBeans[],2,FALSE),\"\")","v":""}]
["","",null,"",null,"","","",{"$f":"IFERROR(VLOOKUP(G108,CoffeeBeans[],3,FALSE),\"\")","v":""},{"$f":"IFERROR(VLOOKUP(H108,CoffeeBeans[],3,FALSE),\"\")","v":""},{"$f":"IFERROR(VLOOKUP(G108,CoffeeBeans[],4,FALSE),\"\")","v":""},{"$f":"IFERROR(VLOOKUP(H108,CoffeeBeans[],4,FALSE),\"\")","v":""},{"$f":"IFERROR(VLOOKUP(G108,CoffeeBeans[],6,FALSE),\"\")","v":""},{"$f":"IFERROR(VLOOKUP(H108,CoffeeBeans[],6,FALSE),\"\")","v":""},{"$f":"IFERROR(VLOOKUP(G108,CoffeeBeans[],2,FALSE),\"\")","v":""},{"$f":"IFERROR(VLOOKUP(H108,CoffeeBeans[],2,FALSE),\"\")","v":""}]
["","",null,"",null,"","","",{"$f":"IFERROR(VLOOKUP(G109,CoffeeBeans[],3,FALSE),\"\")","v":""},{"$f":"IFERROR(VLOOKUP(H109,CoffeeBeans[],3,FALSE),\"\")","v":""},{"$f":"IFERROR(VLOOKUP(G109,CoffeeBeans[],4,FALSE),\"\")","v":""},{"$f":"IFERROR(VLOOKUP(H109,CoffeeBeans[],4,FALSE),\"\")","v":""},{"$f":"IFERROR(VLOOKUP(G109,CoffeeBeans[],6,FALSE),\"\")","v":""},{"$f":"IFERROR(VLOOKUP(H109,CoffeeBeans[],6,FALSE),\"\")","v":""},{"$f":"IFERROR(VLOOKUP(G109,CoffeeBeans[],2,FALSE),\"\")","v":""},{"$f":"IFERROR(VLOOKUP(H109,CoffeeBeans[],2,FALSE),\"\")","v":""}]
["","",null,"",null,"","","",{"$f":"IFERROR(VLOOKUP(G110,CoffeeBeans[],3,FALSE),\"\")","v":""},{"$f":"IFERROR(VLOOKUP(H110,CoffeeBeans[],3,FALSE),\"\")","v":""},{"$f":"IFERROR(VLOOKUP(G110,CoffeeBeans[],4,FALSE),\"\")","v":""},{"$f":"IFERROR(VLOOKUP(H110,CoffeeBeans[],4,FALSE),\"\")","v":""},{"$f":"IFERROR(VLOOKUP(G110,CoffeeBeans[],6,FALSE),\"\")","v":""},{"$f":"IFERROR(VLOOKUP(H110,CoffeeBeans[],6,FALSE),\"\")","v":""},{"$f":"IFERROR(VLOOKUP(G110,CoffeeBeans[],2,FALSE),\"\")","v":""},{"$f":"IFERROR(VLOOKUP(H110,CoffeeBeans[],2,FALSE),\"\")","v":""}]
["","",null,"",null,"","","",{"$f":"IFERROR(VLOOKUP(G111,CoffeeBeans[],3,FALSE),\"\")","v":""},{"$f":"IFERROR(VLOOKUP(H111,CoffeeBeans[],3,FALSE),\"\")","v":""},{"$f":"IFERROR(VLOOKUP(G111,CoffeeBeans[],4,FALSE),\"\")","v":""},{"$f":"IFERROR(VLOOKUP(H111,CoffeeBeans[],4,FALSE),\"\")","v":""},{"$f":"IFERROR(VLOOKUP(G111,CoffeeBeans[],6,FALSE),\"\")","v":""},{"$f":"IFERROR(VLOOKUP(H111,CoffeeBeans[],6,FALSE),\"\")","v":""},{"$f":"IFERROR(VLOOKUP(G111,CoffeeBeans[],2,FALSE),\"\")","v":""},{"$f":"IFERROR(VLOOKUP(H111,CoffeeBeans[],2,FALSE),\"\")","v":""}]
["","",null,"",null,"","","",{"$f":"IFERROR(VLOOKUP(G112,CoffeeBeans[],3,FALSE),\"\")","v":""},{"$f":"IFERROR(VLOOKUP(H112,CoffeeBeans[],3,FALSE),\"\")","v":""},{"$f":"IFERROR(VLOOKUP(G112,CoffeeBeans[],4,FALSE),\"\")","v":""},{"$f":"IFERROR(VLOOKUP(H112,CoffeeBeans[],4,FALSE),\"\")","v":""},{"$f":"IFERROR(VLOOKUP(G112,CoffeeBeans[],6,FALSE),\"\")","v":""},{"$f":"IFERROR(VLOOKUP(H112,CoffeeBeans[],6,FALSE),\"\")","v":""},{"$f":"IFERROR(VLOOKUP(G112,CoffeeBeans[],2,FALSE),\"\")","v":""},{"$f":"IFERROR(VLOOKUP(H112,CoffeeBeans[],2,FALSE),\"\")","v":""}]
["","",null,"",null,"","","",{"$f":"IFERROR(VLOOKUP(G113,CoffeeBeans[],3,FALSE),\"\")","v":""},{"$f":"IFERROR(VLOOKUP(H113,CoffeeBeans[],3,FALSE),\"\")","v":""},{"$f":"IFERROR(VLOOKUP(G113,CoffeeBeans[],4,FALSE),\"\")","v":""},{"$f":"IFERROR(VLOOKUP(H113,CoffeeBeans[],4,FALSE),\"\")","v":""},{"$f":"IFERROR(VLOOKUP(G113,CoffeeBeans[],6,FALSE),\"\")","v":""},{"$f":"IFERROR(VLOOKUP(H113,CoffeeBeans[],6,FALSE),\"\")","v":""},{"$f":"IFERROR(VLOOKUP(G113,CoffeeBeans[],2,FALSE),\"\")","v":""},{"$f":"IFERROR(VLOOKUP(H113,CoffeeBeans[],2,FALSE),\"\")","v":""}]
["","",null,"",null,"","","",{"$f":"IFERROR(VLOOKUP(G114,CoffeeBeans[],3,FALSE),\"\")","v":""},{"$f":"IFERROR(VLOOKUP(H114,CoffeeBeans[],3,FALSE),\"\")","v":""},{"$f":"IFERROR(VLOOKUP(G114,CoffeeBeans[],4,FALSE),\"\")","v":""},{"$f":"IFERROR(VLOOKUP(H114,CoffeeBeans[],4,FALSE),\"\")","v":""},{"$f":"IFERROR(VLOOKUP(G114,CoffeeBeans[],6,FALSE),\"\")","v":""},{"$f":"IFERROR(VLOOKUP(H114,CoffeeBeans[],6,FALSE),\"\")","v":""},{"$f":"IFERROR(VLOOKUP(G114,CoffeeBeans[],2,FALSE),\"\")","v":""},{"$f":"IFERROR(VLOOKUP(H114,CoffeeBeans[],2,FALSE),\"\")","v":""}]
["","",null,"",null,"","","",{"$f":"IFERROR(VLOOKUP(G115,CoffeeBeans[],3,FALSE),\"\")","v":""},{"$f":"IFERROR(VLOOKUP(H115,CoffeeBeans[],3,FALSE),\"\")","v":""},{"$f":"IFERROR(VLOOKUP(G115,CoffeeBeans[],4,FALSE),\"\")","v":""},{"$f":"IFERROR(VLOOKUP(H115,CoffeeBeans[],4,FALSE),\"\")","v":""},{"$f":"IFERROR(VLOOKUP(G115,CoffeeBeans[],6,FALSE),\"\")","v":""},{"$f":"IFERROR(VLOOKUP(H115,CoffeeBeans[],6,FALSE),\"\")","v":""},{"$f":"IFERROR(VLOOKUP(G115,CoffeeBeans[],2,FALSE),\"\")","v":""},{"$f":"IFERROR(VLOOKUP(H115,CoffeeBeans[],2,FALSE),\"\")","v":""}]
["","",null,"",null,"","","",{"$f":"IFERROR(VLOOKUP(G116,CoffeeBeans[],3,FALSE),\"\")","v":""},{"$f":"IFERROR(VLOOKUP(H116,CoffeeBeans[],3,FALSE),\"\")","v":""},{"$f":"IFERROR(VLOOKUP(G116,CoffeeBeans[],4,FALSE),\"\")","v":""},{"$f":"IFERROR(VLOOKUP(H116,CoffeeBeans[],4,FALSE),\"\")","v":""},{"$f":"IFERROR(VLOOKUP(G116,CoffeeBeans[],6,FALSE),\"\")","v":""},{"$f":"IFERROR(VLOOKUP(H116,CoffeeBeans[],6,FALSE),\"\")","v":""},{"$f":"IFERROR(VLOOKUP(G116,CoffeeBeans[],2,FALSE),\"\")","v":""},{"$f":"IFERROR(VLOOKUP(H116,CoffeeBeans[],2,FALSE),\"\")","v":""}]
["","",null,"",null,"","","",{"$f":"IFERROR(VLOOKUP(G117,CoffeeBeans[],3,FALSE),\"\")","v":""},{"$f":"IFERROR(VLOOKUP(H117,CoffeeBeans[],3,FALSE),\"\")","v":""},{"$f":"IFERROR(VLOOKUP(G117,CoffeeBeans[],4,FALSE),\"\")","v":""},{"$f":"IFERROR(VLOOKUP(H117,CoffeeBeans[],4,FALSE),\"\")","v":""},{"$f":"IFERROR(VLOOKUP(G117,CoffeeBeans[],6,FALSE),\"\")","v":""},{"$f":"IFERROR(VLOOKUP(H117,CoffeeBeans[],6,FALSE),\"\")","v":""},{"$f":"IFERROR(VLOOKUP(G117,CoffeeBeans[],2,FALSE),\"\")","v":""},{"$f":"IFERROR(VLOOKUP(H117,CoffeeBeans[],2,FALSE),\"\")","v":""}]
["","",null,"",null,"","","",{"$f":"IFERROR(VLOOKUP(G118,CoffeeBeans[],3,FALSE),\"\")","v":""},{"$f":"IFERROR(VLOOKUP(H118,CoffeeBeans[],3,FALSE),\"\")","v":""},{"$f":"IFERROR(VLOOKUP(G118,CoffeeBeans[],4,FALSE),\"\")","v":""},{"$f":"IFERROR(VLOOKUP(H118,CoffeeBeans[],4,FALSE),\"\")","v":""},{"$f":"IFERROR(VLOOKUP(G118,CoffeeBeans[],6,FALSE),\"\")","v":""},{"$f":"IFERROR(VLOOKUP(H118,CoffeeBeans[],6,FALSE),\"\")","v":""},{"$f":"IFERROR(VLOOKUP(G118,CoffeeBeans[],2,FALSE),\"\")","v":""},{"$f":"IFERROR(VLOOKUP(H118,CoffeeBeans[],2,FALSE),\"\")","v":""}]
["","",null,"",null,"","","",{"$f":"IFERROR(VLOOKUP(G119,CoffeeBeans[],3,FALSE),\"\")","v":""},{"$f":"IFERROR(VLOOKUP(H119,CoffeeBeans[],3,FALSE),\"\")","v":""},{"$f":"IFERROR(VLOOKUP(G119,CoffeeBeans[],4,FALSE),\"\")","v":""},{"$f":"IFERROR(VLOOKUP(H119,CoffeeBeans[],4,FALSE),\"\")","v":""},{"$f":"IFERROR(VLOOKUP(G119,CoffeeBeans[],6,FALSE),\"\")","v":""},{"$f":"IFERROR(VLOOKUP(H119,CoffeeBeans[],6,FALSE),\"\")","v":""},{"$f":"IFERROR(VLOOKUP(G119,CoffeeBeans[],2,FALSE),\"\")","v":""},{"$f":"IFERROR(VLOOKUP(H119,CoffeeBeans[],2,FALSE),\"\")","v":""}]
["","",null,"",null,"","","",{"$f":"IFERROR(VLOOKUP(G120,CoffeeBeans[],3,FALSE),\"\")","v":""},{"$f":"IFERROR(VLOOKUP(H120,CoffeeBeans[],3,FALSE),\"\")","v":""},{"$f":"IFERROR(VLOOKUP(G120,CoffeeBeans[],4,FALSE),\"\")","v":""},{"$f":"IFERROR(VLOOKUP(H120,CoffeeBeans[],4,FALSE),\"\")","v":""},{"$f":"IFERROR(VLOOKUP(G120,CoffeeBeans[],6,FALSE),\"\")","v":""},{"$f":"IFERROR(VLOOKUP(H120,CoffeeBeans[],6,FALSE),\"\")","v":""},{"$f":"IFERROR(VLOOKUP(G120,CoffeeBeans[],2,FALSE),\"\")","v":""},{"$f":"IFERROR(VLOOKUP(H120,CoffeeBeans[],2,FALSE),\"\")","v":""}]
["","",null,"",null,"","","",{"$f":"IFERROR(VLOOKUP(G121,CoffeeBeans[],3,FALSE),\"\")","v":""},{"$f":"IFERROR(VLOOKUP(H121,CoffeeBeans[],3,FALSE),\"\")","v":""},{"$f":"IFERROR(VLOOKUP(G121,CoffeeBeans[],4,FALSE),\"\")","v":""},{"$f":"IFERROR(VLOOKUP(H121,CoffeeBeans[],4,FALSE),\"\")","v":""},{"$f":"IFERROR(VLOOKUP(G121,CoffeeBeans[],6,FALSE),\"\")","v":""},{"$f":"IFERROR(VLOOKUP(H121,CoffeeBeans[],6,FALSE),\"\")","v":""},{"$f":"IFERROR(VLOOKUP(G121,CoffeeBeans[],2,FALSE),\"\")","v":""},{"$f":"IFERROR(VLOOKUP(H121,CoffeeBeans[],2,FALSE),\"\")","v":""}]
["","",null,"",null,"","","",{"$f":"IFERROR(VLOOKUP(G122,CoffeeBeans[],3,FALSE),\"\")","v":""},{"$f":"IFERROR(VLOOKUP(H122,CoffeeBeans[],3,FALSE),\"\")","v":""},{"$f":"IFERROR(VLOOKUP(G122,CoffeeBeans[],4,FALSE),\"\")","v":""},{"$f":"IFERROR(VLOOKUP(H122,CoffeeBeans[],4,FALSE),\"\")","v":""},{"$f":"IFERROR(VLOOKUP(G122,CoffeeBeans[],6,FALSE),\"\")","v":""},{"$f":"IFERROR(VLOOKUP(H122,CoffeeBeans[],6,FALSE),\"\")","v":""},{"$f":"IFERROR(VLOOKUP(G122,CoffeeBeans[],2,FALSE),\"\")","v":""},{"$f":"IFERROR(VLOOKUP(H122,CoffeeBeans[],2,FALSE),\"\")","v":""}]
["","",null,"",null,"","","",{"$f":"IFERROR(VLOOKUP(G123,CoffeeBeans[],3,FALSE),\"\")","v":""},{"$f":"IFERROR(VLOOKUP(H123,CoffeeBeans[],3,FALSE),\"\")","v":""},{"$f":"IFERROR(VLOOKUP(G123,CoffeeBeans[],4,FALSE),\"\")","v":""},{"$f":"IFERROR(VLOOKUP(H123,CoffeeBeans[],4,FALSE),\"\")","v":""},{"$f":"IFERROR(VLOOKUP(G123,CoffeeBeans[],6,FALSE),\"\")","v":""},{"$f":"IFERROR(VLOOKUP(H123,CoffeeBeans[],6,FALSE),\"\")","v":""},{"$f":"IFERROR(VLOOKUP(G123,CoffeeBeans[],2,FALSE),\"\")","v":""},{"$f":"IFERROR(VLOOKUP(H123,CoffeeBeans[],2,FALSE),\"\")","v":""}]
["","",null,"",null,"","","",{"$f":"IFERROR(VLOOKUP(G124,CoffeeBeans[],3,FALSE),\"\")","v":""},{"$f":"IFERROR(VLOOKUP(H124,CoffeeBeans[],3,FALSE),\"\")","v":""},{"$f":"IFERROR(VLOOKUP(G124,CoffeeBeans[],4,FALSE),\"\")","v":""},{"$f":"IFERROR(VLOOKUP(H124,CoffeeBeans[],4,FALSE),\"\")","v":""},{"$f":"IFERROR(VLOOKUP(G124,CoffeeBeans[],6,FALSE),\"\")","v":""},{"$f":"IFERROR(VLOOKUP(H124,CoffeeBeans[],6,FALSE),\"\")","v":""},{"$f":"IFERROR(VLOOKUP(G124,CoffeeBeans[],2,FALSE),\"\")","v":""},{"$f":"IFERROR(VLOOKUP(H124,CoffeeBeans[],2,FALSE),\"\")","v":""}]
["","",null,"",null,"","","",{"$f":"IFERROR(VLOOKUP(G125,CoffeeBeans[],3,FALSE),\"\")","v":""},{"$f":"IFERROR(VLOOKUP(H125,CoffeeBeans[],3,FALSE),\"\")","v":""},{"$f":"IFERROR(VLOOKUP(G125,CoffeeBeans[],4,FALSE),\"\")","v":""},{"$f":"IFERROR(VLOOKUP(H125,CoffeeBeans[],4,FALSE),\"\")","v":""},{"$f":"IFERROR(VLOOKUP(G125,CoffeeBeans[],6,FALSE),\"\")","v":""},{"$f":"IFERROR(VLOOKUP(H125,CoffeeBeans[],6,FALSE),\"\")","v":""},{"$f":"IFERROR(VLOOKUP(G125,CoffeeBeans[],2,FALSE),\"\")","v":""},{"$f":"IFERROR(VLOOKUP(H125,CoffeeBeans[],2,FALSE),\"\")","v":""}]
["","",null,"",null,"","","",{"$f":"IFERROR(VLOOKUP(G126,CoffeeBeans[],3,FALSE),\"\")","v":""},{"$f":"IFERROR(VLOOKUP(H126,CoffeeBeans[],3,FALSE),\"\")","v":""},{"$f":"IFERROR(VLOOKUP(G126,CoffeeBeans[],4,FALSE),\"\")","v":""},{"$f":"IFERROR(VLOOKUP(H126,CoffeeBeans[],4,FALSE),\"\")","v":""},{"$f":"IFERROR(VLOOKUP(G126,CoffeeBeans[],6,FALSE),\"\")","v":""},{"$f":"IFERROR(VLOOKUP(H126,CoffeeBeans[],6,FALSE),\"\")","v":""},{"$f":"IFERROR(VLOOKUP(G126,CoffeeBeans[],2,FALSE),\"\")","v":""},{"$f":"IFERROR(VLOOKUP(H126,CoffeeBeans[],2,FALSE),\"\")","v":""}]
["","",null,"",null,"","","",{"$f":"IFERROR(VLOOKUP(G127,CoffeeBeans[],3,FALSE),\"\")","v":""},{"$f":"IFERROR(VLOOKUP(H127,CoffeeBeans[],3,FALSE),\"\")","v":""},{"$f":"IFERROR(VLOOKUP(G127,CoffeeBeans[],4,FALSE),\"\")","v":""},{"$f":"IFERROR(VLOOKUP(H127,CoffeeBeans[],4,FALSE),\"\")","v":""},{"$f":"IFERROR(VLOOKUP(G127,CoffeeBeans[],6,FALSE),\"\")","v":""},{"$f":"IFERROR(VLOOKUP(H127,CoffeeBeans[],6,FALSE),\"\")","v":""},{"$f":"IFERROR(VLOOKUP(G127,CoffeeBeans[],2,FALSE),\"\")","v":""},{"$f":"IFERROR(VLOOKUP(H127,CoffeeBeans[],2,FALSE),\"\")","v":""}]
["","",null,"",null,"","","",{"$f":"IFERROR(VLOOKUP(G128,CoffeeBeans[],3,FALSE),\"\")","v":""},{"$f":"IFERROR(VLOOKUP(H128,CoffeeBeans[],3,FALSE),\"\")","v":""},{"$f":"IFERROR(VLOOKUP(G128,CoffeeBeans[],4,FALSE),\"\")","v":""},{"$f":"IFERROR(VLOOKUP(H128,CoffeeBeans[],4,FALSE),\"\")","v":""},{"$f":"IFERROR(VLOOKUP(G128,CoffeeBeans[],6,FALSE),\"\")","v":""},{"$f":"IFERROR(VLOOKUP(H128,CoffeeBeans[],6,FALSE),\"\")","v":""},{"$f":"IFERROR(VLOOKUP(G128,CoffeeBeans[],2,FALSE),\"\")","v":""},{"$f":"IFERROR(VLOOKUP(H128,CoffeeBeans[],2,FALSE),\"\")","v":""}]
["","",null,"",null,"","","",{"$f":"IFERROR(VLOOKUP(G129,CoffeeBeans[],3,FALSE),\"\")","v":""},{"$f":"IFERROR(VLOOKUP(H129,CoffeeBeans[],3,FALSE),\"\")","v":""},{"$f":"IFERROR(VLOOKUP(G129,CoffeeBeans[],4,FALSE),\"\")","v":""},{"$f":"IFERROR(VLOOKUP(H129,CoffeeBeans[],4,FALSE),\"\")","v":""},{"$f":"IFERROR(VLOOKUP(G129,CoffeeBeans[],6,FALSE),\"\")","v":""},{"$f":"IFERROR(VLOOKUP(H129,CoffeeBeans[],6,FALSE),\"\")","v":""},{"$f":"IFERROR(VLOOKUP(G129,CoffeeBeans[],2,FALSE),\"\")","v":""},{"$f":"IFERROR(VLOOKUP(H129,CoffeeBeans[],2,FALSE),\"\")","v":""}]
["","",null,{"$f":"IF(ISNUMBER(A130),COUNTIF(G:G,C130)+COUNTIF(H:H,C130),\"\")","v":""},null,{"$f":"IF(F129=\"Pair\",1,IF(ISNUMBER(F129),IF(F129+1>$E$3/2,\"\",F129+1),\"\"))","v":""},{"$f":"IF(ISNUMBER(F130),VLOOKUP(F130,Participants2,2,FALSE),\"\")","v":""},{"$f":"IF(ISNUMBER(F130),VLOOKUP($E$3+1-F130,Participants2,2,FALSE),\"\")","v":""},{"$f":"IFERROR(VLOOKUP(G130,CoffeeBeans[],3,FALSE),\"\")","v":""},{"$f":"IFERROR(VLOOKUP(H130,CoffeeBeans[],3,FALSE),\"\")","v":""},{"$f":"IFERROR(VLOOKUP(G130,CoffeeBeans[],4,FALSE),\"\")","v":""},{"$f":"IFERROR(VLOOKUP(H130,CoffeeBeans[],4,FALSE),\"\")","v":""},{"$f":"IFERROR(VLOOKUP(G130,CoffeeBeans[],6,FALSE),\"\")","v":""},{"$f":"IFERROR(VLOOKUP(H130,CoffeeBeans[],6,FALSE),\"\")","v":""},{"$f":"IFERROR(VLOOKUP(G130,CoffeeBeans[],2,FALSE),\"\")","v":""},{"$f":"IFERROR(VLOOKUP(H130,CoffeeBeans[],2,FALSE),\"\")","v":""}]
[{"$f":"IF(ISBLANK(C131),\"\",RAND())","v":""},{"$f":"IFERROR(_xlfn.RANK.AVG(A131,$A$2:$A$1001,0),\"\")","v":""},null,"",null,"","","",{"$f":"IFERROR(VLOOKUP(G131,CoffeeBeans[],3,FALSE),\"\")","v":""},{"$f":"IFERROR(VLOOKUP(H131,CoffeeBeans[],3,FALSE),\"\")","v":""},{"$f":"IFERROR(VLOOKUP(G131,CoffeeBeans[],4,FALSE),\"\")","v":""},{"$f":"IFERROR(VLOOKUP(H131,CoffeeBeans[],4,FALSE),\"\")","v":""},{"$f":"IFERROR(VLOOKUP(G131,CoffeeBeans[],6,FALSE),\"\")","v":""},{"$f":"IFERROR(VLOOKUP(H131,CoffeeBeans[],6,FALSE),\"\")","v":""},{"$f":"IFERROR(VLOOKUP(G131,CoffeeBeans[],2,FALSE),\"\")","v":""},{"$f":"IFERROR(VLOOKUP(H131,CoffeeBeans[],2,FALSE),\"\")","v":""}]
["","",null,"",null,"","","",{"$f":"IFERROR(VLOOKUP(G132,CoffeeBeans[],3,FALSE),\"\")","v":""},{"$f":"IFERROR(VLOOKUP(H132,CoffeeBeans[],3,FALSE),\"\")","v":""},{"$f":"IFERROR(VLOOKUP(G132,CoffeeBeans[],4,FALSE),\"\")","v":""},{"$f":"IFERROR(VLOOKUP(H132,CoffeeBeans[],4,FALSE),\"\")","v":""},{"$f":"IFERROR(VLOOKUP(G132,CoffeeBeans[],6,FALSE),\"\")","v":""},{"$f":"IFERROR(VLOOKUP(H132,CoffeeBeans[],6,FALSE),\"\")","v":""},{"$f":"IFERROR(VLOOKUP(G132,CoffeeBeans[],2,FALSE),\"\")","v":""},{"$f":"IFERROR(VLOOKUP(H132,CoffeeBeans[],2,FALSE),\"\")","v":""}]
["","",null,"",null,"","","",{"$f":"IFERROR(VLOOKUP(G133,CoffeeBeans[],3,FALSE),\"\")","v":""},{"$f":"IFERROR(VLOOKUP(H133,CoffeeBeans[],3,FALSE),\"\")","v":""},{"$f":"IFERROR(VLOOKUP(G133,CoffeeBeans[],4,FALSE),\"\")","v":""},{"$f":"IFERROR(VLOOKUP(H133,CoffeeBeans[],4,FALSE),\"\")","v":""},{"$f":"IFERROR(VLOOKUP(G133,CoffeeBeans[],6,FALSE),\"\")","v":""},{"$f":"IFERROR(VLOOKUP(H133,CoffeeBeans[],6,FALSE),\"\")","v":""},{"$f":"IFERROR(VLOOKUP(G133,CoffeeBeans[],2,FALSE),\"\")","v":""},{"$f":"IFERROR(VLOOKUP(H133,CoffeeBeans[],2,FALSE),\"\")","v":""}]
["","",null,"",null,"","","",{"$f":"IFERROR(VLOOKUP(G134,CoffeeBeans[],3,FALSE),\"\")","v":""},{"$f":"IFERROR(VLOOKUP(H134,CoffeeBeans[],3,FALSE),\"\")","v":""},{"$f":"IFERROR(VLOOKUP(G134,CoffeeBeans[],4,FALSE),\"\")","v":""},{"$f":"IFERROR(VLOOKUP(H134,CoffeeBeans[],4,FALSE),\"\")","v":""},{"$f":"IFERROR(VLOOKUP(G134,CoffeeBeans[],6,FALSE),\"\")","v":""},{"$f":"IFERROR(VLOOKUP(H134,CoffeeBeans[],6,FALSE),\"\")","v":""},{"$f":"IFERROR(VLOOKUP(G134,CoffeeBeans[],2,FALSE),\"\")","v":""},{"$f":"IFERROR(VLOOKUP(H134,CoffeeBeans[],2,FALSE),\"\")","v":""}]
["","",null,"",null,"","","",{"$f":"IFERROR(VLOOKUP(G135,CoffeeBeans[],3,FALSE),\"\")","v":""},{"$f":"IFERROR(VLOOKUP(H135,CoffeeBeans[],3,FALSE),\"\")","v":""},{"$f":"IFERROR(VLOOKUP(G135,CoffeeBeans[],4,FALSE),\"\")","v":""},{"$f":"IFERROR(VLOOKUP(H135,CoffeeBeans[],4,FALSE),\"\")","v":""},{"$f":"IFERROR(VLOOKUP(G135,CoffeeBeans[],6,FALSE),\"\")","v":""},{"$f":"IFERROR(VLOOKUP(H135,CoffeeBeans[],6,FALSE),\"\")","v":""},{"$f":"IFERROR(VLOOKUP(G135,CoffeeBeans[],2,FALSE),\"\")","v":""},{"$f":"IFERROR(VLOOKUP(H135,CoffeeBeans[],2,FALSE),\"\")","v":""}]
["","",null,"",null,"","","",{"$f":"IFERROR(VLOOKUP(G136,CoffeeBeans[],3,FALSE),\"\")","v":""},{"$f":"IFERROR(VLOOKUP(H136,CoffeeBeans[],3,FALSE),\"\")","v":""},{"$f":"IFERROR(VLOOKUP(G136,CoffeeBeans[],4,FALSE),\"\")","v":""},{"$f":"IFERROR(VLOOKUP(H136,CoffeeBeans[],4,FALSE),\"\")","v":""},{"$f":"IFERROR(VLOOKUP(G136,CoffeeBeans[],6,FALSE),\"\")","v":""},{"$f":"IFERROR(VLOOKUP(H136,CoffeeBeans[],6,FALSE),\"\")","v":""},{"$f":"IFERROR(VLOOKUP(G136,CoffeeBeans[],2,FALSE),\"\")","v":""},{"$f":"IFERROR(VLOOKUP(H136,CoffeeBeans[],2,FALSE),\"\")","v":""}]
["","",null,"",null,"","","",{"$f":"IFERROR(VLOOKUP(G137,CoffeeBeans[],3,FALSE),\"\")","v":""},{"$f":"IFERROR(VLOOKUP(H137,CoffeeBeans[],3,FALSE),\"\")","v":""},{"$f":"IFERROR(VLOOKUP(G137,CoffeeBeans[],4,FALSE),\"\")","v":""},{"$f":"IFERROR(VLOOKUP(H137,CoffeeBeans[],4,FALSE),\"\")","v":""},{"$f":"IFERROR(VLOOKUP(G137,CoffeeBeans[],6,FALSE),\"\")","v":""},{"$f":"IFERROR(VLOOKUP(H137,CoffeeBeans[],6,FALSE),\"\")","v":""},{"$f":"IFERROR(VLOOKUP(G137,CoffeeBeans[],2,FALSE),\"\")","v":""},{"$f":"IFERROR(VLOOKUP(H137,CoffeeBeans[],2,FALSE),\"\")","v":""}]
["","",null,"",null,"","","",{"$f":"IFERROR(VLOOKUP(G138,CoffeeBeans[],3,FALSE),\"\")","v":""},{"$f":"IFERROR(VLOOKUP(H138,CoffeeBeans[],3,FALSE),\"\")","v":""},{"$f":"IFERROR(VLOOKUP(G138,CoffeeBeans[],4,FALSE),\"\")","v":""},{"$f":"IFERROR(VLOOKUP(H138,CoffeeBeans[],4,FALSE),\"\")","v":""},{"$f":"IFERROR(VLOOKUP(G138,CoffeeBeans[],6,FALSE),\"\")","v":""},{"$f":"IFERROR(VLOOKUP(H138,CoffeeBeans[],6,FALSE),\"\")","v":""},{"$f":"IFERROR(VLOOKUP(G138,CoffeeBeans[],2,FALSE),\"\")","v":""},{"$f":"IFERROR(VLOOKUP(H138,CoffeeBeans[],2,FALSE),\"\")","v":""}]
["","",null,"",null,"","","",{"$f":"IFERROR(VLOOKUP(G139,CoffeeBeans[],3,FALSE),\"\")","v":""},{"$f":"IFERROR(VLOOKUP(H139,CoffeeBeans[],3,FALSE),\"\")","v":""},{"$f":"IFERROR(VLOOKUP(G139,CoffeeBeans[],4,FALSE),\"\")","v":""},{"$f":"IFERROR(VLOOKUP(H139,CoffeeBeans[],4,FALSE),\"\")","v":""},{"$f":"IFERROR(VLOOKUP(G139,CoffeeBeans[],6,FALSE),\"\")","v":""},{"$f":"IFERROR(VLOOKUP(H139,CoffeeBeans[],6,FALSE),\"\")","v":""},{"$f":"IFERROR(VLOOKUP(G139,CoffeeBeans[],2,FALSE),\"\")","v":""},{"$f":"IFERROR(VLOOKUP(H139,CoffeeBeans[],2,FALSE),\"\")","v":""}]
["","",null,"",null,"","","",{"$f":"IFERROR(VLOOKUP(G140,CoffeeBeans[],3,FALSE),\"\")","v":""},{"$f":"IFERROR(VLOOKUP(H140,CoffeeBeans[],3,FALSE),\"\")","v":""},{"$f":"IFERROR(VLOOKUP(G140,CoffeeBeans[],4,FALSE),\"\")","v":""},{"$f":"IFERROR(VLOOKUP(H140,CoffeeBeans[],4,FALSE),\"\")","v":""},{"$f":"IFERROR(VLOOKUP(G140,CoffeeBeans[],6,FALSE),\"\")","v":""},{"$f":"IFERROR(VLOOKUP(H140,CoffeeBeans[],6,FALSE),\"\")","v":""},{"$f":"IFERROR(VLOOKUP(G140,CoffeeBeans[],2,FALSE),\"\")","v":""},{"$f":"IFERROR(VLOOKUP(H140,CoffeeBeans[],2,FALSE),\"\")","v":""}]
["","",null,"",null,"","","",{"$f":"IFERROR(VLOOKUP(G141,CoffeeBeans[],3,FALSE),\"\")","v":""},{"$f":"IFERROR(VLOOKUP(H141,CoffeeBeans[],3,FALSE),\"\")","v":""},{"$f":"IFERROR(VLOOKUP(G141,CoffeeBeans[],4,FALSE),\"\")","v":""},{"$f":"IFERROR(VLOOKUP(H141,CoffeeBeans[],4,FALSE),\"\")","v":""},{"$f":"IFERROR(VLOOKUP(G141,CoffeeBeans[],6,FALSE),\"\")","v":""},{"$f":"IFERROR(VLOOKUP(H141,CoffeeBeans[],6,FALSE),\"\")","v":""},{"$f":"IFERROR(VLOOKUP(G141,CoffeeBeans[],2,FALSE),\"\")","v":""},{"$f":"IFERROR(VLOOKUP(H141,CoffeeBeans[],2,FALSE),\"\")","v":""}]
["","",null,"",null,"","","",{"$f":"IFERROR(VLOOKUP(G142,CoffeeBeans[],3,FALSE),\"\")","v":""},{"$f":"IFERROR(VLOOKUP(H142,CoffeeBeans[],3,FALSE),\"\")","v":""},{"$f":"IFERROR(VLOOKUP(G142,CoffeeBeans[],4,FALSE),\"\")","v":""},{"$f":"IFERROR(VLOOKUP(H142,CoffeeBeans[],4,FALSE),\"\")","v":""},{"$f":"IFERROR(VLOOKUP(G142,CoffeeBeans[],6,FALSE),\"\")","v":""},{"$f":"IFERROR(VLOOKUP(H142,CoffeeBeans[],6,FALSE),\"\")","v":""},{"$f":"IFERROR(VLOOKUP(G142,CoffeeBeans[],2,FALSE),\"\")","v":""},{"$f":"IFERROR(VLOOKUP(H142,CoffeeBeans[],2,FALSE),\"\")","v":""}]
["","",null,"",null,"","","",{"$f":"IFERROR(VLOOKUP(G143,CoffeeBeans[],3,FALSE),\"\")","v":""},{"$f":"IFERROR(VLOOKUP(H143,CoffeeBeans[],3,FALSE),\"\")","v":""},{"$f":"IFERROR(VLOOKUP(G143,CoffeeBeans[],4,FALSE),\"\")","v":""},{"$f":"IFERROR(VLOOKUP(H143,CoffeeBeans[],4,FALSE),\"\")","v":""},{"$f":"IFERROR(VLOOKUP(G143,CoffeeBeans[],6,FALSE),\"\")","v":""},{"$f":"IFERROR(VLOOKUP(H143,CoffeeBeans[],6,FALSE),\"\")","v":""},{"$f":"IFERROR(VLOOKUP(G143,CoffeeBeans[],2,FALSE),\"\")","v":""},{"$f":"IFERROR(VLOOKUP(H143,CoffeeBeans[],2,FALSE),\"\")","v":""}]
["","",null,"",null,"","","",{"$f":"IFERROR(VLOOKUP(G144,CoffeeBeans[],3,FALSE),\"\")","v":""},{"$f":"IFERROR(VLOOKUP(H144,CoffeeBeans[],3,FALSE),\"\")","v":""},{"$f":"IFERROR(VLOOKUP(G144,CoffeeBeans[],4,FALSE),\"\")","v":""},{"$f":"IFERROR(VLOOKUP(H144,CoffeeBeans[],4,FALSE),\"\")","v":""},{"$f":"IFERROR(VLOOKUP(G144,CoffeeBeans[],6,FALSE),\"\")","v":""},{"$f":"IFERROR(VLOOKUP(H144,CoffeeBeans[],6,FALSE),\"\")","v":""},{"$f":"IFERROR(VLOOKUP(G144,CoffeeBeans[],2,FALSE),\"\")","v":""},{"$f":"IFERROR(VLOOKUP(H144,CoffeeBeans[],2,FALSE),\"\")","v":""}]
["","",null,"",null,"","","",{"$f":"IFERROR(VLOOKUP(G145,CoffeeBeans[],3,FALSE),\"\")","v":""},{"$f":"IFERROR(VLOOKUP(H145,CoffeeBeans[],3,FALSE),\"\")","v":""},{"$f":"IFERROR(VLOOKUP(G145,CoffeeBeans[],4,FALSE),\"\")","v":""},{"$f":"IFERROR(VLOOKUP(H145,CoffeeBeans[],4,FALSE),\"\")","v":""},{"$f":"IFERROR(VLOOKUP(G145,CoffeeBeans[],6,FALSE),\"\")","v":""},{"$f":"IFERROR(VLOOKUP(H145,CoffeeBeans[],6,FALSE),\"\")","v":""},{"$f":"IFERROR(VLOOKUP(G145,CoffeeBeans[],2,FALSE),\"\")","v":""},{"$f":"IFERROR(VLOOKUP(H145,CoffeeBeans[],2,FALSE),\"\")","v":""}]
["","",null,"",null,"","","",{"$f":"IFERROR(VLOOKUP(G146,CoffeeBeans[],3,FALSE),\"\")","v":""},{"$f":"IFERROR(VLOOKUP(H146,CoffeeBeans[],3,FALSE),\"\")","v":""},{"$f":"IFERROR(VLOOKUP(G146,CoffeeBeans[],4,FALSE),\"\")","v":""},{"$f":"IFERROR(VLOOKUP(H146,CoffeeBeans[],4,FALSE),\"\")","v":""},{"$f":"IFERROR(VLOOKUP(G146,CoffeeBeans[],6,FALSE),\"\")","v":""},{"$f":"IFERROR(VLOOKUP(H146,CoffeeBeans[],6,FALSE),\"\")","v":""},{"$f":"IFERROR(VLOOKUP(G146,CoffeeBeans[],2,FALSE),\"\")","v":""},{"$f":"IFERROR(VLOOKUP(H146,CoffeeBeans[],2,FALSE),\"\")","v":""}]
["","",null,"",null,"","","",{"$f":"IFERROR(VLOOKUP(G147,CoffeeBeans[],3,FALSE),\"\")","v":""},{"$f":"IFERROR(VLOOKUP(H147,CoffeeBeans[],3,FALSE),\"\")","v":""},{"$f":"IFERROR(VLOOKUP(G147,CoffeeBeans[],4,FALSE),\"\")","v":""},{"$f":"IFERROR(VLOOKUP(H147,CoffeeBeans[],4,FALSE),\"\")","v":""},{"$f":"IFERROR(VLOOKUP(G147,CoffeeBeans[],6,FALSE),\"\")","v":""},{"$f":"IFERROR(VLOOKUP(H147,CoffeeBeans[],6,FALSE),\"\")","v":""},{"$f":"IFERROR(VLOOKUP(G147,CoffeeBeans[],2,FALSE),\"\")","v":""},{"$f":"IFERROR(VLOOKUP(H147,CoffeeBeans[],2,FALSE),\"\")","v":""}]
["","",null,"",null,"","","",{"$f":"IFERROR(VLOOKUP(G148,CoffeeBeans[],3,FALSE),\"\")","v":""},{"$f":"IFERROR(VLOOKUP(H148,CoffeeBeans[],3,FALSE),\"\")","v":""},{"$f":"IFERROR(VLOOKUP(G148,CoffeeBeans[],4,FALSE),\"\")","v":""},{"$f":"IFERROR(VLOOKUP(H148,CoffeeBeans[],4,FALSE),\"\")","v":""},{"$f":"IFERROR(VLOOKUP(G148,CoffeeBeans[],6,FALSE),\"\")","v":""},{"$f":"IFERROR(VLOOKUP(H148,CoffeeBeans[],6,FALSE),\"\")","v":""},{"$f":"IFERROR(VLOOKUP(G148,CoffeeBeans[],2,FALSE),\"\")","v":""},{"$f":"IFERROR(VLOOKUP(H148,CoffeeBeans[],2,FALSE),\"\")","v":""}]
["","",null,"",null,"","","",{"$f":"IFERROR(VLOOKUP(G149,CoffeeBeans[],3,FALSE),\"\")","v":""},{"$f":"IFERROR(VLOOKUP(H149,CoffeeBeans[],3,FALSE),\"\")","v":""},{"$f":"IFERROR(VLOOKUP(G149,CoffeeBeans[],4,FALSE),\"\")","v":""},{"$f":"IFERROR(VLOOKUP(H149,CoffeeBeans[],4,FALSE),\"\")","v":""},{"$f":"IFERROR(VLOOKUP(G149,CoffeeBeans[],6,FALSE),\"\")","v":""},{"$f":"IFERROR(VLOOKUP(H149,CoffeeBeans[],6,FALSE),\"\")","v":""},{"$f":"IFERROR(VLOOKUP(G149,CoffeeBeans[],2,FALSE),\"\")","v":""},{"$f":"IFERROR(VLOOKUP(H149,CoffeeBeans[],2,FALSE),\"\")","v":""}]
["","",null,"",null,"","","",{"$f":"IFERROR(VLOOKUP(G150,CoffeeBeans[],3,FALSE),\"\")","v":""},{"$f":"IFERROR(VLOOKUP(H150,CoffeeBeans[],3,FALSE),\"\")","v":""},{"$f":"IFERROR(VLOOKUP(G150,CoffeeBeans[],4,FALSE),\"\")","v":""},{"$f":"IFERROR(VLOOKUP(H150,CoffeeBeans[],4,FALSE),\"\")","v":""},{"$f":"IFERROR(VLOOKUP(G150,CoffeeBeans[],6,FALSE),\"\")","v":""},{"$f":"IFERROR(VLOOKUP(H150,CoffeeBeans[],6,FALSE),\"\")","v":""},{"$f":"IFERROR(VLOOKUP(G150,CoffeeBeans[],2,FALSE),\"\")","v":""},{"$f":"IFERROR(VLOOKUP(H150,CoffeeBeans[],2,FALSE),\"\")","v":""}]
["","",null,"",null,"","","",{"$f":"IFERROR(VLOOKUP(G151,CoffeeBeans[],3,FALSE),\"\")","v":""},{"$f":"IFERROR(VLOOKUP(H151,CoffeeBeans[],3,FALSE),\"\")","v":""},{"$f":"IFERROR(VLOOKUP(G151,CoffeeBeans[],4,FALSE),\"\")","v":""},{"$f":"IFERROR(VLOOKUP(H151,CoffeeBeans[],4,FALSE),\"\")","v":""},{"$f":"IFERROR(VLOOKUP(G151,CoffeeBeans[],6,FALSE),\"\")","v":""},{"$f":"IFERROR(VLOOKUP(H151,CoffeeBeans[],6,FALSE),\"\")","v":""},{"$f":"IFERROR(VLOOKUP(G151,CoffeeBeans[],2,FALSE),\"\")","v":""},{"$f":"IFERROR(VLOOKUP(H151,CoffeeBeans[],2,FALSE),\"\")","v":""}]
["","",null,"",null,"","","",{"$f":"IFERROR(VLOOKUP(G152,CoffeeBeans[],3,FALSE),\"\")","v":""},{"$f":"IFERROR(VLOOKUP(H152,CoffeeBeans[],3,FALSE),\"\")","v":""},{"$f":"IFERROR(VLOOKUP(G152,CoffeeBeans[],4,FALSE),\"\")","v":""},{"$f":"IFERROR(VLOOKUP(H152,CoffeeBeans[],4,FALSE),\"\")","v":""},{"$f":"IFERROR(VLOOKUP(G152,CoffeeBeans[],6,FALSE),\"\")","v":""},{"$f":"IFERROR(VLOOKUP(H152,CoffeeBeans[],6,FALSE),\"\")","v":""},{"$f":"IFERROR(VLOOKUP(G152,CoffeeBeans[],2,FALSE),\"\")","v":""},{"$f":"IFERROR(VLOOKUP(H152,CoffeeBeans[],2,FALSE),\"\")","v":""}]
["","",null,"",null,"","","",{"$f":"IFERROR(VLOOKUP(G153,CoffeeBeans[],3,FALSE),\"\")","v":""},{"$f":"IFERROR(VLOOKUP(H153,CoffeeBeans[],3,FALSE),\"\")","v":""},{"$f":"IFERROR(VLOOKUP(G153,CoffeeBeans[],4,FALSE),\"\")","v":""},{"$f":"IFERROR(VLOOKUP(H153,CoffeeBeans[],4,FALSE),\"\")","v":""},{"$f":"IFERROR(VLOOKUP(G153,CoffeeBeans[],6,FALSE),\"\")","v":""},{"$f":"IFERROR(VLOOKUP(H153,CoffeeBeans[],6,FALSE),\"\")","v":""},{"$f":"IFERROR(VLOOKUP(G153,CoffeeBeans[],2,FALSE),\"\")","v":""},{"$f":"IFERROR(VLOOKUP(H153,CoffeeBeans[],2,FALSE),\"\")","v":""}]
["","",null,"",null,"","","",{"$f":"IFERROR(VLOOKUP(G154,CoffeeBeans[],3,FALSE),\"\")","v":""},{"$f":"IFERROR(VLOOKUP(H154,CoffeeBeans[],3,FALSE),\"\")","v":""},{"$f":"IFERROR(VLOOKUP(G154,CoffeeBeans[],4,FALSE),\"\")","v":""},{"$f":"IFERROR(VLOOKUP(H154,CoffeeBeans[],4,FALSE),\"\")","v":""},{"$f":"IFERROR(VLOOKUP(G154,CoffeeBeans[],6,FALSE),\"\")","v":""},{"$f":"IFERROR(VLOOKUP(H154,CoffeeBeans[],6,FALSE),\"\")","v":""},{"$f":"IFERROR(VLOOKUP(G154,CoffeeBeans[],2,FALSE),\"\")","v":""},{"$f":"IFERROR(VLOOKUP(H154,CoffeeBeans[],2,FALSE),\"\")","v":""}]
["","",null,"",null,"","","",{"$f":"IFERROR(VLOOKUP(G155,CoffeeBeans[],3,FALSE),\"\")","v":""},{"$f":"IFERROR(VLOOKUP(H155,CoffeeBeans[],3,FALSE),\"\")","v":""},{"$f":"IFERROR(VLOOKUP(G155,CoffeeBeans[],4,FALSE),\"\")","v":""},{"$f":"IFERROR(VLOOKUP(H155,CoffeeBeans[],4,FALSE),\"\")","v":""},{"$f":"IFERROR(VLOOKUP(G155,CoffeeBeans[],6,FALSE),\"\")","v":""},{"$f":"IFERROR(VLOOKUP(H155,CoffeeBeans[],6,FALSE),\"\")","v":""},{"$f":"IFERROR(VLOOKUP(G155,CoffeeBeans[],2,FALSE),\"\")","v":""},{"$f":"IFERROR(VLOOKUP(H155,CoffeeBeans[],2,FALSE),\"\")","v":""}]
["","",null,"",null,"","","",{"$f":"IFERROR(VLOOKUP(G156,CoffeeBeans[],3,FALSE),\"\")","v":""},{"$f":"IFERROR(VLOOKUP(H156,CoffeeBeans[],3,FALSE),\"\")","v":""},{"$f":"IFERROR(VLOOKUP(G156,CoffeeBeans[],4,FALSE),\"\")","v":""},{"$f":"IFERROR(VLOOKUP(H156,CoffeeBeans[],4,FALSE),\"\")","v":""},{"$f":"IFERROR(VLOOKUP(G156,CoffeeBeans[],6,FALSE),\"\")","v":""},{"$f":"IFERROR(VLOOKUP(H156,CoffeeBeans[],6,FALSE),\"\")","v":""},{"$f":"IFERROR(VLOOKUP(G156,CoffeeBeans[],2,FALSE),\"\")","v":""},{"$f":"IFERROR(VLOOKUP(H156,CoffeeBeans[],2,FALSE),\"\")","v":""}]
["","",null,"",null,"","","",{"$f":"IFERROR(VLOOKUP(G157,CoffeeBeans[],3,FALSE),\"\")","v":""},{"$f":"IFERROR(VLOOKUP(H157,CoffeeBeans[],3,FALSE),\"\")","v":""},{"$f":"IFERROR(VLOOKUP(G157,CoffeeBeans[],4,FALSE),\"\")","v":""},{"$f":"IFERROR(VLOOKUP(H157,CoffeeBeans[],4,FALSE),\"\")","v":""},{"$f":"IFERROR(VLOOKUP(G157,CoffeeBeans[],6,FALSE),\"\")","v":""},{"$f":"IFERROR(VLOOKUP(H157,CoffeeBeans[],6,FALSE),\"\")","v":""},{"$f":"IFERROR(VLOOKUP(G157,CoffeeBeans[],2,FALSE),\"\")","v":""},{"$f":"IFERROR(VLOOKUP(H157,CoffeeBeans[],2,FALSE),\"\")","v":""}]
["","",null,"",null,"","","",{"$f":"IFERROR(VLOOKUP(G158,CoffeeBeans[],3,FALSE),\"\")","v":""},{"$f":"IFERROR(VLOOKUP(H158,CoffeeBeans[],3,FALSE),\"\")","v":""},{"$f":"IFERROR(VLOOKUP(G158,CoffeeBeans[],4,FALSE),\"\")","v":""},{"$f":"IFERROR(VLOOKUP(H158,CoffeeBeans[],4,FALSE),\"\")","v":""},{"$f":"IFERROR(VLOOKUP(G158,CoffeeBeans[],6,FALSE),\"\")","v":""},{"$f":"IFERROR(VLOOKUP(H158,CoffeeBeans[],6,FALSE),\"\")","v":""},{"$f":"IFERROR(VLOOKUP(G158,CoffeeBeans[],2,FALSE),\"\")","v":""},{"$f":"IFERROR(VLOOKUP(H158,CoffeeBeans[],2,FALSE),\"\")","v":""}]
["","",null,"",null,"","","",{"$f":"IFERROR(VLOOKUP(G159,CoffeeBeans[],3,FALSE),\"\")","v":""},{"$f":"IFERROR(VLOOKUP(H159,CoffeeBeans[],3,FALSE),\"\")","v":""},{"$f":"IFERROR(VLOOKUP(G159,CoffeeBeans[],4,FALSE),\"\")","v":""},{"$f":"IFERROR(VLOOKUP(H159,CoffeeBeans[],4,FALSE),\"\")","v":""},{"$f":"IFERROR(VLOOKUP(G159,CoffeeBeans[],6,FALSE),\"\")","v":""},{"$f":"IFERROR(VLOOKUP(H159,CoffeeBeans[],6,FALSE),\"\")","v":""},{"$f":"IFERROR(VLOOKUP(G159,CoffeeBeans[],2,FALSE),\"\")","v":""},{"$f":"IFERROR(VLOOKUP(H159,CoffeeBeans[],2,FALSE),\"\")","v":""}]
["","",null,"",null,"","","",{"$f":"IFERROR(VLOOKUP(G160,CoffeeBeans[],3,FALSE),\"\")","v":""},{"$f":"IFERROR(VLOOKUP(H160,CoffeeBeans[],3,FALSE),\"\")","v":""},{"$f":"IFERROR(VLOOKUP(G160,CoffeeBeans[],4,FALSE),\"\")","v":""},{"$f":"IFERROR(VLOOKUP(H160,CoffeeBeans[],4,FALSE),\"\")","v":""},{"$f":"IFERROR(VLOOKUP(G160,CoffeeBeans[],6,FALSE),\"\")","v":""},{"$f":"IFERROR(VLOOKUP(H160,CoffeeBeans[],6,FALSE),\"\")","v":""},{"$f":"IFERROR(VLOOKUP(G160,CoffeeBeans[],2,FALSE),\"\")","v":""},{"$f":"IFERROR(VLOOKUP(H160,CoffeeBeans[],2,FALSE),\"\")","v":""}]
["","",null,"",null,"","","",{"$f":"IFERROR(VLOOKUP(G161,CoffeeBeans[],3,FALSE),\"\")","v":""},{"$f":"IFERROR(VLOOKUP(H161,CoffeeBeans[],3,FALSE),\"\")","v":""},{"$f":"IFERROR(VLOOKUP(G161,CoffeeBeans[],4,FALSE),\"\")","v":""},{"$f":"IFERROR(VLOOKUP(H161,CoffeeBeans[],4,FALSE),\"\")","v":""},{"$f":"IFERROR(VLOOKUP(G161,CoffeeBeans[],6,FALSE),\"\")","v":""},{"$f":"IFERROR(VLOOKUP(H161,CoffeeBeans[],6,FALSE),\"\")","v":""},{"$f":"IFERROR(VLOOKUP(G161,CoffeeBeans[],2,FALSE),\"\")","v":""},{"$f":"IFERROR(VLOOKUP(H161,CoffeeBeans[],2,FALSE),\"\")","v":""}]
["","",null,"",null,"","","",{"$f":"IFERROR(VLOOKUP(G162,CoffeeBeans[],3,FALSE),\"\")","v":""},{"$f":"IFERROR(VLOOKUP(H162,CoffeeBeans[],3,FALSE),\"\")","v":""},{"$f":"IFERROR(VLOOKUP(G162,CoffeeBeans[],4,FALSE),\"\")","v":""},{"$f":"IFERROR(VLOOKUP(H162,CoffeeBeans[],4,FALSE),\"\")","v":""},{"$f":"IFERROR(VLOOKUP(G162,CoffeeBeans[],6,FALSE),\"\")","v":""},{"$f":"IFERROR(VLOOKUP(H162,CoffeeBeans[],6,FALSE),\"\")","v":""},{"$f":"IFERROR(VLOOKUP(G162,CoffeeBeans[],2,FALSE),\"\")","v":""},{"$f":"IFERROR(VLOOKUP(H162,CoffeeBeans[],2,FALSE),\"\")","v":""}]
["","",null,"",null,"","","",{"$f":"IFERROR(VLOOKUP(G163,CoffeeBeans[],3,FALSE),\"\")","v":""},{"$f":"IFERROR(VLOOKUP(H163,CoffeeBeans[],3,FALSE),\"\")","v":""},{"$f":"IFERROR(VLOOKUP(G163,CoffeeBeans[],4,FALSE),\"\")","v":""},{"$f":"IFERROR(VLOOKUP(H163,CoffeeBeans[],4,FALSE),\"\")","v":""},{"$f":"IFERROR(VLOOKUP(G163,CoffeeBeans[],6,FALSE),\"\")","v":""},{"$f":"IFERROR(VLOOKUP(H163,CoffeeBeans[],6,FALSE),\"\")","v":""},{"$f":"IFERROR(VLOOKUP(G163,CoffeeBeans[],2,FALSE),\"\")","v":""},{"$f":"IFERROR(VLOOKUP(H163,CoffeeBeans[],2,FALSE),\"\")","v":""}]
["","",null,"",null,"","","",{"$f":"IFERROR(VLOOKUP(G164,CoffeeBeans[],3,FALSE),\"\")","v":""},{"$f":"IFERROR(VLOOKUP(H164,CoffeeBeans[],3,FALSE),\"\")","v":""},{"$f":"IFERROR(VLOOKUP(G164,CoffeeBeans[],4,FALSE),\"\")","v":""},{"$f":"IFERROR(VLOOKUP(H164,CoffeeBeans[],4,FALSE),\"\")","v":""},{"$f":"IFERROR(VLOOKUP(G164,CoffeeBeans[],6,FALSE),\"\")","v":""},{"$f":"IFERROR(VLOOKUP(H164,CoffeeBeans[],6,FALSE),\"\")","v":""},{"$f":"IFERROR(VLOOKUP(G164,CoffeeBeans[],2,FALSE),\"\")","v":""},{"$f":"IFERROR(VLOOKUP(H164,CoffeeBeans[],2,FALSE),\"\")","v":""}]
["","",null,"",null,"","","",{"$f":"IFERROR(VLOOKUP(G165,CoffeeBeans[],3,FALSE),\"\")","v":""},{"$f":"IFERROR(VLOOKUP(H165,CoffeeBeans[],3,FALSE),\"\")","v":""},{"$f":"IFERROR(VLOOKUP(G165,CoffeeBeans[],4,FALSE),\"\")","v":""},{"$f":"IFERROR(VLOOKUP(H165,CoffeeBeans[],4,FALSE),\"\")","v":""},{"$f":"IFERROR(VLOOKUP(G165,CoffeeBeans[],6,FALSE),\"\")","v":""},{"$f":"IFERROR(VLOOKUP(H165,CoffeeBeans[],6,FALSE),\"\")","v":""},{"$f":"IFERROR(VLOOKUP(G165,CoffeeBeans[],2,FALSE),\"\")","v":""},{"$f":"IFERROR(VLOOKUP(H165,CoffeeBeans[],2,FALSE),\"\")","v":""}]
["","",null,"",null,"","","",{"$f":"IFERROR(VLOOKUP(G166,CoffeeBeans[],3,FALSE),\"\")","v":""},{"$f":"IFERROR(VLOOKUP(H166,CoffeeBeans[],3,FALSE),\"\")","v":""},{"$f":"IFERROR(VLOOKUP(G166,CoffeeBeans[],4,FALSE),\"\")","v":""},{"$f":"IFERROR(VLOOKUP(H166,CoffeeBeans[],4,FALSE),\"\")","v":""},{"$f":"IFERROR(VLOOKUP(G166,CoffeeBeans[],6,FALSE),\"\")","v":""},{"$f":"IFERROR(VLOOKUP(H166,CoffeeBeans[],6,FALSE),\"\")","v":""},{"$f":"IFERROR(VLOOKUP(G166,CoffeeBeans[],2,FALSE),\"\")","v":""},{"$f":"IFERROR(VLOOKUP(H166,CoffeeBeans[],2,FALSE),\"\")","v":""}]
["","",null,"",null,"","","",{"$f":"IFERROR(VLOOKUP(G167,CoffeeBeans[],3,FALSE),\"\")","v":""},{"$f":"IFERROR(VLOOKUP(H167,CoffeeBeans[],3,FALSE),\"\")","v":""},{"$f":"IFERROR(VLOOKUP(G167,CoffeeBeans[],4,FALSE),\"\")","v":""},{"$f":"IFERROR(VLOOKUP(H167,CoffeeBeans[],4,FALSE),\"\")","v":""},{"$f":"IFERROR(VLOOKUP(G167,CoffeeBeans[],6,FALSE),\"\")","v":""},{"$f":"IFERROR(VLOOKUP(H167,CoffeeBeans[],6,FALSE),\"\")","v":""},{"$f":"IFERROR(VLOOKUP(G167,CoffeeBeans[],2,FALSE),\"\")","v":""},{"$f":"IFERROR(VLOOKUP(H167,CoffeeBeans[],2,FALSE),\"\")","v":""}]
["","",null,"",null,"","","",{"$f":"IFERROR(VLOOKUP(G168,CoffeeBeans[],3,FALSE),\"\")","v":""},{"$f":"IFERROR(VLOOKUP(H168,CoffeeBeans[],3,FALSE),\"\")","v":""},{"$f":"IFERROR(VLOOKUP(G168,CoffeeBeans[],4,FALSE),\"\")","v":""},{"$f":"IFERROR(VLOOKUP(H168,CoffeeBeans[],4,FALSE),\"\")","v":""},{"$f":"IFERROR(VLOOKUP(G168,CoffeeBeans[],6,FALSE),\"\")","v":""},{"$f":"IFERROR(VLOOKUP(H168,CoffeeBeans[],6,FALSE),\"\")","v":""},{"$f":"IFERROR(VLOOKUP(G168,CoffeeBeans[],2,FALSE),\"\")","v":""},{"$f":"IFERROR(VLOOKUP(H168,CoffeeBeans[],2,FALSE),\"\")","v":""}]
["","",null,"",null,"","","",{"$f":"IFERROR(VLOOKUP(G169,CoffeeBeans[],3,FALSE),\"\")","v":""},{"$f":"IFERROR(VLOOKUP(H169,CoffeeBeans[],3,FALSE),\"\")","v":""},{"$f":"IFERROR(VLOOKUP(G169,CoffeeBeans[],4,FALSE),\"\")","v":""},{"$f":"IFERROR(VLOOKUP(H169,CoffeeBeans[],4,FALSE),\"\")","v":""},{"$f":"IFERROR(VLOOKUP(G169,CoffeeBeans[],6,FALSE),\"\")","v":""},{"$f":"IFERROR(VLOOKUP(H169,CoffeeBeans[],6,FALSE),\"\")","v":""},{"$f":"IFERROR(VLOOKUP(G169,CoffeeBeans[],2,FALSE),\"\")","v":""},{"$f":"IFERROR(VLOOKUP(H169,CoffeeBeans[],2,FALSE),\"\")","v":""}]
["","",null,"",null,"","","",{"$f":"IFERROR(VLOOKUP(G170,CoffeeBeans[],3,FALSE),\"\")","v":""},{"$f":"IFERROR(VLOOKUP(H170,CoffeeBeans[],3,FALSE),\"\")","v":""},{"$f":"IFERROR(VLOOKUP(G170,CoffeeBeans[],4,FALSE),\"\")","v":""},{"$f":"IFERROR(VLOOKUP(H170,CoffeeBeans[],4,FALSE),\"\")","v":""},{"$f":"IFERROR(VLOOKUP(G170,CoffeeBeans[],6,FALSE),\"\")","v":""},{"$f":"IFERROR(VLOOKUP(H170,CoffeeBeans[],6,FALSE),\"\")","v":""},{"$f":"IFERROR(VLOOKUP(G170,CoffeeBeans[],2,FALSE),\"\")","v":""},{"$f":"IFERROR(VLOOKUP(H170,CoffeeBeans[],2,FALSE),\"\")","v":""}]
["","",null,"",null,"","","",{"$f":"IFERROR(VLOOKUP(G171,CoffeeBeans[],3,FALSE),\"\")","v":""},{"$f":"IFERROR(VLOOKUP(H171,CoffeeBeans[],3,FALSE),\"\")","v":""},{"$f":"IFERROR(VLOOKUP(G171,CoffeeBeans[],4,FALSE),\"\")","v":""},{"$f":"IFERROR(VLOOKUP(H171,CoffeeBeans[],4,FALSE),\"\")","v":""},{"$f":"IFERROR(VLOOKUP(G171,CoffeeBeans[],6,FALSE),\"\")","v":""},{"$f":"IFERROR(VLOOKUP(H171,CoffeeBeans[],6,FALSE),\"\")","v":""},{"$f":"IFERROR(VLOOKUP(G171,CoffeeBeans[],2,FALSE),\"\")","v":""},{"$f":"IFERROR(VLOOKUP(H171,CoffeeBeans[],2,FALSE),\"\")","v":""}]
["","",null,"",null,"","","",{"$f":"IFERROR(VLOOKUP(G172,CoffeeBeans[],3,FALSE),\"\")","v":""},{"$f":"IFERROR(VLOOKUP(H172,CoffeeBeans[],3,FALSE),\"\")","v":""},{"$f":"IFERROR(VLOOKUP(G172,CoffeeBeans[],4,FALSE),\"\")","v":""},{"$f":"IFERROR(VLOOKUP(H172,CoffeeBeans[],4,FALSE),\"\")","v":""},{"$f":"IFERROR(VLOOKUP(G172,CoffeeBeans[],6,FALSE),\"\")","v":""},{"$f":"IFERROR(VLOOKUP(H172,CoffeeBeans[],6,FALSE),\"\")","v":""},{"$f":"IFERROR(VLOOKUP(G172,CoffeeBeans[],2,FALSE),\"\")","v":""},{"$f":"IFERROR(VLOOKUP(H172,CoffeeBeans[],2,FALSE),\"\")","v":""}]
["","",null,"",null,"","","",{"$f":"IFERROR(VLOOKUP(G173,CoffeeBeans[],3,FALSE),\"\")","v":""},{"$f":"IFERROR(VLOOKUP(H173,CoffeeBeans[],3,FALSE),\"\")","v":""},{"$f":"IFERROR(VLOOKUP(G173,CoffeeBeans[],4,FALSE),\"\")","v":""},{"$f":"IFERROR(VLOOKUP(H173,CoffeeBeans[],4,FALSE),\"\")","v":""},{"$f":"IFERROR(VLOOKUP(G173,CoffeeBeans[],6,FALSE),\"\")","v":""},{"$f":"IFERROR(VLOOKUP(H173,CoffeeBeans[],6,FALSE),\"\")","v":""},{"$f":"IFERROR(VLOOKUP(G173,CoffeeBeans[],2,FALSE),\"\")","v":""},{"$f":"IFERROR(VLOOKUP(H173,CoffeeBeans[],2,FALSE),\"\")","v":""}]
["","",null,"",null,"","","",{"$f":"IFERROR(VLOOKUP(G174,CoffeeBeans[],3,FALSE),\"\")","v":""},{"$f":"IFERROR(VLOOKUP(H174,CoffeeBeans[],3,FALSE),\"\")","v":""},{"$f":"IFERROR(VLOOKUP(G174,CoffeeBeans[],4,FALSE),\"\")","v":""},{"$f":"IFERROR(VLOOKUP(H174,CoffeeBeans[],4,FALSE),\"\")","v":""},{"$f":"IFERROR(VLOOKUP(G174,CoffeeBeans[],6,FALSE),\"\")","v":""},{"$f":"IFERROR(VLOOKUP(H174,CoffeeBeans[],6,FALSE),\"\")","v":""},{"$f":"IFERROR(VLOOKUP(G174,CoffeeBeans[],2,FALSE),\"\")","v":""},{"$f":"IFERROR(VLOOKUP(H174,CoffeeBeans[],2,FALSE),\"\")","v":""}]
["","",null,"",null,"","","",{"$f":"IFERROR(VLOOKUP(G175,CoffeeBeans[],3,FALSE),\"\")","v":""},{"$f":"IFERROR(VLOOKUP(H175,CoffeeBeans[],3,FALSE),\"\")","v":""},{"$f":"IFERROR(VLOOKUP(G175,CoffeeBeans[],4,FALSE),\"\")","v":""},{"$f":"IFERROR(VLOOKUP(H175,CoffeeBeans[],4,FALSE),\"\")","v":""},{"$f":"IFERROR(VLOOKUP(G175,CoffeeBeans[],6,FALSE),\"\")","v":""},{"$f":"IFERROR(VLOOKUP(H175,CoffeeBeans[],6,FALSE),\"\")","v":""},{"$f":"IFERROR(VLOOKUP(G175,CoffeeBeans[],2,FALSE),\"\")","v":""},{"$f":"IFERROR(VLOOKUP(H175,CoffeeBeans[],2,FALSE),\"\")","v":""}]
["","",null,"",null,"","","",{"$f":"IFERROR(VLOOKUP(G176,CoffeeBeans[],3,FALSE),\"\")","v":""},{"$f":"IFERROR(VLOOKUP(H176,CoffeeBeans[],3,FALSE),\"\")","v":""},{"$f":"IFERROR(VLOOKUP(G176,CoffeeBeans[],4,FALSE),\"\")","v":""},{"$f":"IFERROR(VLOOKUP(H176,CoffeeBeans[],4,FALSE),\"\")","v":""},{"$f":"IFERROR(VLOOKUP(G176,CoffeeBeans[],6,FALSE),\"\")","v":""},{"$f":"IFERROR(VLOOKUP(H176,CoffeeBeans[],6,FALSE),\"\")","v":""},{"$f":"IFERROR(VLOOKUP(G176,CoffeeBeans[],2,FALSE),\"\")","v":""},{"$f":"IFERROR(VLOOKUP(H176,CoffeeBeans[],2,FALSE),\"\")","v":""}]
["","",null,"",null,"","","",{"$f":"IFERROR(VLOOKUP(G177,CoffeeBeans[],3,FALSE),\"\")","v":""},{"$f":"IFERROR(VLOOKUP(H177,CoffeeBeans[],3,FALSE),\"\")","v":""},{"$f":"IFERROR(VLOOKUP(G177,CoffeeBeans[],4,FALSE),\"\")","v":""},{"$f":"IFERROR(VLOOKUP(H177,CoffeeBeans[],4,FALSE),\"\")","v":""},{"$f":"IFERROR(VLOOKUP(G177,CoffeeBeans[],6,FALSE),\"\")","v":""},{"$f":"IFERROR(VLOOKUP(H177,CoffeeBeans[],6,FALSE),\"\")","v":""},{"$f":"IFERROR(VLOOKUP(G177,CoffeeBeans[],2,FALSE),\"\")","v":""},{"$f":"IFERROR(VLOOKUP(H177,CoffeeBeans[],2,FALSE),\"\")","v":""}]
["","",null,"",null,"","","",{"$f":"IFERROR(VLOOKUP(G178,CoffeeBeans[],3,FALSE),\"\")","v":""},{"$f":"IFERROR(VLOOKUP(H178,CoffeeBeans[],3,FALSE),\"\")","v":""},{"$f":"IFERROR(VLOOKUP(G178,CoffeeBeans[],4,FALSE),\"\")","v":""},{"$f":"IFERROR(VLOOKUP(H178,CoffeeBeans[],4,FALSE),\"\")","v":""},{"$f":"IFERROR(VLOOKUP(G178,CoffeeBeans[],6,FALSE),\"\")","v":""},{"$f":"IFERROR(VLOOKUP(H178,CoffeeBeans[],6,FALSE),\"\")","v":""},{"$f":"IFERROR(VLOOKUP(G178,CoffeeBeans[],2,FALSE),\"\")","v":""},{"$f":"IFERROR(VLOOKUP(H178,CoffeeBeans[],2,FALSE),\"\")","v":""}]
["","",null,"",null,"","","",{"$f":"IFERROR(VLOOKUP(G179,CoffeeBeans[],3,FALSE),\"\")","v":""},{"$f":"IFERROR(VLOOKUP(H179,CoffeeBeans[],3,FALSE),\"\")","v":""},{"$f":"IFERROR(VLOOKUP(G179,CoffeeBeans[],4,FALSE),\"\")","v":""},{"$f":"IFERROR(VLOOKUP(H179,CoffeeBeans[],4,FALSE),\"\")","v":""},{"$f":"IFERROR(VLOOKUP(G179,CoffeeBeans[],6,FALSE),\"\")","v":""},{"$f":"IFERROR(VLOOKUP(H179,CoffeeBeans[],6,FALSE),\"\")","v":""},{"$f":"IFERROR(VLOOKUP(G179,CoffeeBeans[],2,FALSE),\"\")","v":""},{"$f":"IFERROR(VLOOKUP(H179,CoffeeBeans[],2,FALSE),\"\")","v":""}]
["","",null,"",null,"","","",{"$f":"IFERROR(VLOOKUP(G180,CoffeeBeans[],3,FALSE),\"\")","v":""},{"$f":"IFERROR(VLOOKUP(H180,CoffeeBeans[],3,FALSE),\"\")","v":""},{"$f":"IFERROR(VLOOKUP(G180,CoffeeBeans[],4,FALSE),\"\")","v":""},{"$f":"IFERROR(VLOOKUP(H180,CoffeeBeans[],4,FALSE),\"\")","v":""},{"$f":"IFERROR(VLOOKUP(G180,CoffeeBeans[],6,FALSE),\"\")","v":""},{"$f":"IFERROR(VLOOKUP(H180,CoffeeBeans[],6,FALSE),\"\")","v":""},{"$f":"IFERROR(VLOOKUP(G180,CoffeeBeans[],2,FALSE),\"\")","v":""},{"$f":"IFERROR(VLOOKUP(H180,CoffeeBeans[],2,FALSE),\"\")","v":""}]
["","",null,"",null,"","","",{"$f":"IFERROR(VLOOKUP(G181,CoffeeBeans[],3,FALSE),\"\")","v":""},{"$f":"IFERROR(VLOOKUP(H181,CoffeeBeans[],3,FALSE),\"\")","v":""},{"$f":"IFERROR(VLOOKUP(G181,CoffeeBeans[],4,FALSE),\"\")","v":""},{"$f":"IFERROR(VLOOKUP(H181,CoffeeBeans[],4,FALSE),\"\")","v":""},{"$f":"IFERROR(VLOOKUP(G181,CoffeeBeans[],6,FALSE),\"\")","v":""},{"$f":"IFERROR(VLOOKUP(H181,CoffeeBeans[],6,FALSE),\"\")","v":""},{"$f":"IFERROR(VLOOKUP(G181,CoffeeBeans[],2,FALSE),\"\")","v":""},{"$f":"IFERROR(VLOOKUP(H181,CoffeeBeans[],2,FALSE),\"\")","v":""}]
["","",null,"",null,"","","",{"$f":"IFERROR(VLOOKUP(G182,CoffeeBeans[],3,FALSE),\"\")","v":""},{"$f":"IFERROR(VLOOKUP(H182,CoffeeBeans[],3,FALSE),\"\")","v":""},{"$f":"IFERROR(VLOOKUP(G182,CoffeeBeans[],4,FALSE),\"\")","v":""},{"$f":"IFERROR(VLOOKUP(H182,CoffeeBeans[],4,FALSE),\"\")","v":""},{"$f":"IFERROR(VLOOKUP(G182,CoffeeBeans[],6,FALSE),\"\")","v":""},{"$f":"IFERROR(VLOOKUP(H182,CoffeeBeans[],6,FALSE),\"\")","v":""},{"$f":"IFERROR(VLOOKUP(G182,CoffeeBeans[],2,FALSE),\"\")","v":""},{"$f":"IFERROR(VLOOKUP(H182,CoffeeBeans[],2,FALSE),\"\")","v":""}]
["","",null,"",null,"","","",{"$f":"IFERROR(VLOOKUP(G183,CoffeeBeans[],3,FALSE),\"\")","v":""},{"$f":"IFERROR(VLOOKUP(H183,CoffeeBeans[],3,FALSE),\"\")","v":""},{"$f":"IFERROR(VLOOKUP(G183,CoffeeBeans[],4,FALSE),\"\")","v":""},{"$f":"IFERROR(VLOOKUP(H183,CoffeeBeans[],4,FALSE),\"\")","v":""},{"$f":"IFERROR(VLOOKUP(G183,CoffeeBeans[],6,FALSE),\"\")","v":""},{"$f":"IFERROR(VLOOKUP(H183,CoffeeBeans[],6,FALSE),\"\")","v":""},{"$f":"IFERROR(VLOOKUP(G183,CoffeeBeans[],2,FALSE),\"\")","v":""},{"$f":"IFERROR(VLOOKUP(H183,CoffeeBeans[],2,FALSE),\"\")","v":""}]
["","",null,"",null,"","","",{"$f":"IFERROR(VLOOKUP(G184,CoffeeBeans[],3,FALSE),\"\")","v":""},{"$f":"IFERROR(VLOOKUP(H184,CoffeeBeans[],3,FALSE),\"\")","v":""},{"$f":"IFERROR(VLOOKUP(G184,CoffeeBeans[],4,FALSE),\"\")","v":""},{"$f":"IFERROR(VLOOKUP(H184,CoffeeBeans[],4,FALSE),\"\")","v":""},{"$f":"IFERROR(VLOOKUP(G184,CoffeeBeans[],6,FALSE),\"\")","v":""},{"$f":"IFERROR(VLOOKUP(H184,CoffeeBeans[],6,FALSE),\"\")","v":""},{"$f":"IFERROR(VLOOKUP(G184,CoffeeBeans[],2,FALSE),\"\")","v":""},{"$f":"IFERROR(VLOOKUP(H184,CoffeeBeans[],2,FALSE),\"\")","v":""}]
["","",null,"",null,"","","",{"$f":"IFERROR(VLOOKUP(G185,CoffeeBeans[],3,FALSE),\"\")","v":""},{"$f":"IFERROR(VLOOKUP(H185,CoffeeBeans[],3,FALSE),\"\")","v":""},{"$f":"IFERROR(VLOOKUP(G185,CoffeeBeans[],4,FALSE),\"\")","v":""},{"$f":"IFERROR(VLOOKUP(H185,CoffeeBeans[],4,FALSE),\"\")","v":""},{"$f":"IFERROR(VLOOKUP(G185,CoffeeBeans[],6,FALSE),\"\")","v":""},{"$f":"IFERROR(VLOOKUP(H185,CoffeeBeans[],6,FALSE),\"\")","v":""},{"$f":"IFERROR(VLOOKUP(G185,CoffeeBeans[],2,FALSE),\"\")","v":""},{"$f":"IFERROR(VLOOKUP(H185,CoffeeBeans[],2,FALSE),\"\")","v":""}]
["","",null,"",null,"","","",{"$f":"IFERROR(VLOOKUP(G186,CoffeeBeans[],3,FALSE),\"\")","v":""},{"$f":"IFERROR(VLOOKUP(H186,CoffeeBeans[],3,FALSE),\"\")","v":""},{"$f":"IFERROR(VLOOKUP(G186,CoffeeBeans[],4,FALSE),\"\")","v":""},{"$f":"IFERROR(VLOOKUP(H186,CoffeeBeans[],4,FALSE),\"\")","v":""},{"$f":"IFERROR(VLOOKUP(G186,CoffeeBeans[],6,FALSE),\"\")","v":""},{"$f":"IFERROR(VLOOKUP(H186,CoffeeBeans[],6,FALSE),\"\")","v":""},{"$f":"IFERROR(VLOOKUP(G186,CoffeeBeans[],2,FALSE),\"\")","v":""},{"$f":"IFERROR(VLOOKUP(H186,CoffeeBeans[],2,FALSE),\"\")","v":""}]
["","",null,"",null,"","","",{"$f":"IFERROR(VLOOKUP(G187,CoffeeBeans[],3,FALSE),\"\")","v":""},{"$f":"IFERROR(VLOOKUP(H187,CoffeeBeans[],3,FALSE),\"\")","v":""},{"$f":"IFERROR(VLOOKUP(G187,CoffeeBeans[],4,FALSE),\"\")","v":""},{"$f":"IFERROR(VLOOKUP(H187,CoffeeBeans[],4,FALSE),\"\")","v":""},{"$f":"IFERROR(VLOOKUP(G187,CoffeeBeans[],6,FALSE),\"\")","v":""},{"$f":"IFERROR(VLOOKUP(H187,CoffeeBeans[],6,FALSE),\"\")","v":""},{"$f":"IFERROR(VLOOKUP(G187,CoffeeBeans[],2,FALSE),\"\")","v":""},{"$f":"IFERROR(VLOOKUP(H187,CoffeeBeans[],2,FALSE),\"\")","v":""}]
["","",null,"",null,"","","",{"$f":"IFERROR(VLOOKUP(G188,CoffeeBeans[],3,FALSE),\"\")","v":""},{"$f":"IFERROR(VLOOKUP(H188,CoffeeBeans[],3,FALSE),\"\")","v":""},{"$f":"IFERROR(VLOOKUP(G188,CoffeeBeans[],4,FALSE),\"\")","v":""},{"$f":"IFERROR(VLOOKUP(H188,CoffeeBeans[],4,FALSE),\"\")","v":""},{"$f":"IFERROR(VLOOKUP(G188,CoffeeBeans[],6,FALSE),\"\")","v":""},{"$f":"IFERROR(VLOOKUP(H188,CoffeeBeans[],6,FALSE),\"\")","v":""},{"$f":"IFERROR(VLOOKUP(G188,CoffeeBeans[],2,FALSE),\"\")","v":""},{"$f":"IFERROR(VLOOKUP(H188,CoffeeBeans[],2,FALSE),\"\")","v":""}]
["","",null,"",null,"","","",{"$f":"IFERROR(VLOOKUP(G189,CoffeeBeans[],3,FALSE),\"\")","v":""},{"$f":"IFERROR(VLOOKUP(H189,CoffeeBeans[],3,FALSE),\"\")","v":""},{"$f":"IFERROR(VLOOKUP(G189,CoffeeBeans[],4,FALSE),\"\")","v":""},{"$f":"IFERROR(VLOOKUP(H189,CoffeeBeans[],4,FALSE),\"\")","v":""},{"$f":"IFERROR(VLOOKUP(G189,CoffeeBeans[],6,FALSE),\"\")","v":""},{"$f":"IFERROR(VLOOKUP(H189,CoffeeBeans[],6,FALSE),\"\")","v":""},{"$f":"IFERROR(VLOOKUP(G189,CoffeeBeans[],2,FALSE),\"\")","v":""},{"$f":"IFERROR(VLOOKUP(H189,CoffeeBeans[],2,FALSE),\"\")","v":""}]
["","",null,"",null,"","","",{"$f":"IFERROR(VLOOKUP(G190,CoffeeBeans[],3,FALSE),\"\")","v":""},{"$f":"IFERROR(VLOOKUP(H190,CoffeeBeans[],3,FALSE),\"\")","v":""},{"$f":"IFERROR(VLOOKUP(G190,CoffeeBeans[],4,FALSE),\"\")","v":""},{"$f":"IFERROR(VLOOKUP(H190,CoffeeBeans[],4,FALSE),\"\")","v":""},{"$f":"IFERROR(VLOOKUP(G190,CoffeeBeans[],6,FALSE),\"\")","v":""},{"$f":"IFERROR(VLOOKUP(H190,CoffeeBeans[],6,FALSE),\"\")","v":""},{"$f":"IFERROR(VLOOKUP(G190,CoffeeBeans[],2,FALSE),\"\")","v":""},{"$f":"IFERROR(VLOOKUP(H190,CoffeeBeans[],2,FALSE),\"\")","v":""}]
["","",null,"",null,"","","",{"$f":"IFERROR(VLOOKUP(G191,CoffeeBeans[],3,FALSE),\"\")","v":""},{"$f":"IFERROR(VLOOKUP(H191,CoffeeBeans[],3,FALSE),\"\")","v":""},{"$f":"IFERROR(VLOOKUP(G191,CoffeeBeans[],4,FALSE),\"\")","v":""},{"$f":"IFERROR(VLOOKUP(H191,CoffeeBeans[],4,FALSE),\"\")","v":""},{"$f":"IFERROR(VLOOKUP(G191,CoffeeBeans[],6,FALSE),\"\")","v":""},{"$f":"IFERROR(VLOOKUP(H191,CoffeeBeans[],6,FALSE),\"\")","v":""},{"$f":"IFERROR(VLOOKUP(G191,CoffeeBeans[],2,FALSE),\"\")","v":""},{"$f":"IFERROR(VLOOKUP(H191,CoffeeBeans[],2,FALSE),\"\")","v":""}]
["","",null,"",null,"","","",{"$f":"IFERROR(VLOOKUP(G192,CoffeeBeans[],3,FALSE),\"\")","v":""},{"$f":"IFERROR(VLOOKUP(H192,CoffeeBeans[],3,FALSE),\"\")","v":""},{"$f":"IFERROR(VLOOKUP(G192,CoffeeBeans[],4,FALSE),\"\")","v":""},{"$f":"IFERROR(VLOOKUP(H192,CoffeeBeans[],4,FALSE),\"\")","v":""},{"$f":"IFERROR(VLOOKUP(G192,CoffeeBeans[],6,FALSE),\"\")","v":""},{"$f":"IFERROR(VLOOKUP(H192,CoffeeBeans[],6,FALSE),\"\")","v":""},{"$f":"IFERROR(VLOOKUP(G192,CoffeeBeans[],2,FALSE),\"\")","v":""},{"$f":"IFERROR(VLOOKUP(H192,CoffeeBeans[],2,FALSE),\"\")","v":""}]
["","",null,"",null,"","","",{"$f":"IFERROR(VLOOKUP(G193,CoffeeBeans[],3,FALSE),\"\")","v":""},{"$f":"IFERROR(VLOOKUP(H193,CoffeeBeans[],3,FALSE),\"\")","v":""},{"$f":"IFERROR(VLOOKUP(G193,CoffeeBeans[],4,FALSE),\"\")","v":""},{"$f":"IFERROR(VLOOKUP(H193,CoffeeBeans[],4,FALSE),\"\")","v":""},{"$f":"IFERROR(VLOOKUP(G193,CoffeeBeans[],6,FALSE),\"\")","v":""},{"$f":"IFERROR(VLOOKUP(H193,CoffeeBeans[],6,FALSE),\"\")","v":""},{"$f":"IFERROR(VLOOKUP(G193,CoffeeBeans[],2,FALSE),\"\")","v":""},{"$f":"IFERROR(VLOOKUP(H193,CoffeeBeans[],2,FALSE),\"\")","v":""}]
["","",null,{"$f":"IF(ISNUMBER(A194),COUNTIF(G:G,C194)+COUNTIF(H:H,C194),\"\")","v":""},null,{"$f":"IF(F193=\"Pair\",1,IF(ISNUMBER(F193),IF(F193+1>$E$3/2,\"\",F193+1),\"\"))","v":""},{"$f":"IF(ISNUMBER(F194),VLOOKUP(F194,Participants2,2,FALSE),\"\")","v":""},{"$f":"IF(ISNUMBER(F194),VLOOKUP($E$3+1-F194,Participants2,2,FALSE),\"\")","v":""},{"$f":"IFERROR(VLOOKUP(G194,CoffeeBeans[],3,FALSE),\"\")","v":""},{"$f":"IFERROR(VLOOKUP(H194,CoffeeBeans[],3,FALSE),\"\")","v":""},{"$f":"IFERROR(VLOOKUP(G194,CoffeeBeans[],4,FALSE),\"\")","v":""},{"$f":"IFERROR(VLOOKUP(H194,CoffeeBeans[],4,FALSE),\"\")","v":""},{"$f":"IFERROR(VLOOKUP(G194,CoffeeBeans[],6,FALSE),\"\")","v":""},{"$f":"IFERROR(VLOOKUP(H194,CoffeeBeans[],6,FALSE),\"\")","v":""},{"$f":"IFERROR(VLOOKUP(G194,CoffeeBeans[],2,FALSE),\"\")","v":""},{"$f":"IFERROR(VLOOKUP(H194,CoffeeBeans[],2,FALSE),\"\")","v":""}]
[{"$f":"IF(ISBLANK(C195),\"\",RAND())","v":""},{"$f":"IFERROR(_xlfn.RANK.AVG(A195,$A$2:$A$1001,0),\"\")","v":""},null,"",null,"","","",{"$f":"IFERROR(VLOOKUP(G195,CoffeeBeans[],3,FALSE),\"\")","v":""},{"$f":"IFERROR(VLOOKUP(H195,CoffeeBeans[],3,FALSE),\"\")","v":""},{"$f":"IFERROR(VLOOKUP(G195,CoffeeBeans[],4,FALSE),\"\")","v":""},{"$f":"IFERROR(VLOOKUP(H195,CoffeeBeans[],4,FALSE),\"\")","v":""},{"$f":"IFERROR(VLOOKUP(G195,CoffeeBeans[],6,FALSE),\"\")","v":""},{"$f":"IFERROR(VLOOKUP(H195,CoffeeBeans[],6,FALSE),\"\")","v":""},{"$f":"IFERROR(VLOOKUP(G195,CoffeeBeans[],2,FALSE),\"\")","v":""},{"$f":"IFERROR(VLOOKUP(H195,CoffeeBeans[],2,FALSE),\"\")","v":""}]
["","",null,"",null,"","","",{"$f":"IFERROR(VLOOKUP(G196,CoffeeBeans[],3,FALSE),\"\")","v":""},{"$f":"IFERROR(VLOOKUP(H196,CoffeeBeans[],3,FALSE),\"\")","v":""},{"$f":"IFERROR(VLOOKUP(G196,CoffeeBeans[],4,FALSE),\"\")","v":""},{"$f":"IFERROR(VLOOKUP(H196,CoffeeBeans[],4,FALSE),\"\")","v":""},{"$f":"IFERROR(VLOOKUP(G196,CoffeeBeans[],6,FALSE),\"\")","v":""},{"$f":"IFERROR(VLOOKUP(H196,CoffeeBeans[],6,FALSE),\"\")","v":""},{"$f":"IFERROR(VLOOKUP(G196,CoffeeBeans[],2,FALSE),\"\")","v":""},{"$f":"IFERROR(VLOOKUP(H196,CoffeeBeans[],2,FALSE),\"\")","v":""}]
["","",null,"",null,"","","",{"$f":"IFERROR(VLOOKUP(G197,CoffeeBeans[],3,FALSE),\"\")","v":""},{"$f":"IFERROR(VLOOKUP(H197,CoffeeBeans[],3,FALSE),\"\")","v":""},{"$f":"IFERROR(VLOOKUP(G197,CoffeeBeans[],4,FALSE),\"\")","v":""},{"$f":"IFERROR(VLOOKUP(H197,CoffeeBeans[],4,FALSE),\"\")","v":""},{"$f":"IFERROR(VLOOKUP(G197,CoffeeBeans[],6,FALSE),\"\")","v":""},{"$f":"IFERROR(VLOOKUP(H197,CoffeeBeans[],6,FALSE),\"\")","v":""},{"$f":"IFERROR(VLOOKUP(G197,CoffeeBeans[],2,FALSE),\"\")","v":""},{"$f":"IFERROR(VLOOKUP(H197,CoffeeBeans[],2,FALSE),\"\")","v":""}]
["","",null,"",null,"","","",{"$f":"IFERROR(VLOOKUP(G198,CoffeeBeans[],3,FALSE),\"\")","v":""},{"$f":"IFERROR(VLOOKUP(H198,CoffeeBeans[],3,FALSE),\"\")","v":""},{"$f":"IFERROR(VLOOKUP(G198,CoffeeBeans[],4,FALSE),\"\")","v":""},{"$f":"IFERROR(VLOOKUP(H198,CoffeeBeans[],4,FALSE),\"\")","v":""},{"$f":"IFERROR(VLOOKUP(G198,CoffeeBeans[],6,FALSE),\"\")","v":""},{"$f":"IFERROR(VLOOKUP(H198,CoffeeBeans[],6,FALSE),\"\")","v":""},{"$f":"IFERROR(VLOOKUP(G198,CoffeeBeans[],2,FALSE),\"\")","v":""},{"$f":"IFERROR(VLOOKUP(H198,CoffeeBeans[],2,FALSE),\"\")","v":""}]
["","",null,"",null,"","","",{"$f":"IFERROR(VLOOKUP(G199,CoffeeBeans[],3,FALSE),\"\")","v":""},{"$f":"IFERROR(VLOOKUP(H199,CoffeeBeans[],3,FALSE),\"\")","v":""},{"$f":"IFERROR(VLOOKUP(G199,CoffeeBeans[],4,FALSE),\"\")","v":""},{"$f":"IFERROR(VLOOKUP(H199,CoffeeBeans[],4,FALSE),\"\")","v":""},{"$f":"IFERROR(VLOOKUP(G199,CoffeeBeans[],6,FALSE),\"\")","v":""},{"$f":"IFERROR(VLOOKUP(H199,CoffeeBeans[],6,FALSE),\"\")","v":""},{"$f":"IFERROR(VLOOKUP(G199,CoffeeBeans[],2,FALSE),\"\")","v":""},{"$f":"IFERROR(VLOOKUP(H199,CoffeeBeans[],2,FALSE),\"\")","v":""}]
["","",null,"",null,"","","",{"$f":"IFERROR(VLOOKUP(G200,CoffeeBeans[],3,FALSE),\"\")","v":""},{"$f":"IFERROR(VLOOKUP(H200,CoffeeBeans[],3,FALSE),\"\")","v":""},{"$f":"IFERROR(VLOOKUP(G200,CoffeeBeans[],4,FALSE),\"\")","v":""},{"$f":"IFERROR(VLOOKUP(H200,CoffeeBeans[],4,FALSE),\"\")","v":""},{"$f":"IFERROR(VLOOKUP(G200,CoffeeBeans[],6,FALSE),\"\")","v":""},{"$f":"IFERROR(VLOOKUP(H200,CoffeeBeans[],6,FALSE),\"\")","v":""},{"$f":"IFERROR(VLOOKUP(G200,CoffeeBeans[],2,FALSE),\"\")","v":""},{"$f":"IFERROR(VLOOKUP(H200,CoffeeBeans[],2,FALSE),\"\")","v":""}]
["","",null,"",null,"","","",{"$f":"IFERROR(VLOOKUP(G201,CoffeeBeans[],3,FALSE),\"\")","v":""},{"$f":"IFERROR(VLOOKUP(H201,CoffeeBeans[],3,FALSE),\"\")","v":""},{"$f":"IFERROR(VLOOKUP(G201,CoffeeBeans[],4,FALSE),\"\")","v":""},{"$f":"IFERROR(VLOOKUP(H201,CoffeeBeans[],4,FALSE),\"\")","v":""},{"$f":"IFERROR(VLOOKUP(G201,CoffeeBeans[],6,FALSE),\"\")","v":""},{"$f":"IFERROR(VLOOKUP(H201,CoffeeBeans[],6,FALSE),\"\")","v":""},{"$f":"IFERROR(VLOOKUP(G201,CoffeeBeans[],2,FALSE),\"\")","v":""},{"$f":"IFERROR(VLOOKUP(H201,CoffeeBeans[],2,FALSE),\"\")","v":""}]
["","",null,"",null,"","","",{"$f":"IFERROR(VLOOKUP(G202,CoffeeBeans[],3,FALSE),\"\")","v":""},{"$f":"IFERROR(VLOOKUP(H202,CoffeeBeans[],3,FALSE),\"\")","v":""},{"$f":"IFERROR(VLOOKUP(G202,CoffeeBeans[],4,FALSE),\"\")","v":""},{"$f":"IFERROR(VLOOKUP(H202,CoffeeBeans[],4,FALSE),\"\")","v":""},{"$f":"IFERROR(VLOOKUP(G202,CoffeeBeans[],6,FALSE),\"\")","v":""},{"$f":"IFERROR(VLOOKUP(H202,CoffeeBeans[],6,FALSE),\"\")","v":""},{"$f":"IFERROR(VLOOKUP(G202,CoffeeBeans[],2,FALSE),\"\")","v":""},{"$f":"IFERROR(VLOOKUP(H202,CoffeeBeans[],2,FALSE),\"\")","v":""}]
["","",null,"",null,"","","",{"$f":"IFERROR(VLOOKUP(G203,CoffeeBeans[],3,FALSE),\"\")","v":""},{"$f":"IFERROR(VLOOKUP(H203,CoffeeBeans[],3,FALSE),\"\")","v":""},{"$f":"IFERROR(VLOOKUP(G203,CoffeeBeans[],4,FALSE),\"\")","v":""},{"$f":"IFERROR(VLOOKUP(H203,CoffeeBeans[],4,FALSE),\"\")","v":""},{"$f":"IFERROR(VLOOKUP(G203,CoffeeBeans[],6,FALSE),\"\")","v":""},{"$f":"IFERROR(VLOOKUP(H203,CoffeeBeans[],6,FALSE),\"\")","v":""},{"$f":"IFERROR(VLOOKUP(G203,CoffeeBeans[],2,FALSE),\"\")","v":""},{"$f":"IFERROR(VLOOKUP(H203,CoffeeBeans[],2,FALSE),\"\")","v":""}]
["","",null,"",null,"","","",{"$f":"IFERROR(VLOOKUP(G204,CoffeeBeans[],3,FALSE),\"\")","v":""},{"$f":"IFERROR(VLOOKUP(H204,CoffeeBeans[],3,FALSE),\"\")","v":""},{"$f":"IFERROR(VLOOKUP(G204,CoffeeBeans[],4,FALSE),\"\")","v":""},{"$f":"IFERROR(VLOOKUP(H204,CoffeeBeans[],4,FALSE),\"\")","v":""},{"$f":"IFERROR(VLOOKUP(G204,CoffeeBeans[],6,FALSE),\"\")","v":""},{"$f":"IFERROR(VLOOKUP(H204,CoffeeBeans[],6,FALSE),\"\")","v":""},{"$f":"IFERROR(VLOOKUP(G204,CoffeeBeans[],2,FALSE),\"\")","v":""},{"$f":"IFERROR(VLOOKUP(H204,CoffeeBeans[],2,FALSE),\"\")","v":""}]
["","",null,"",null,"","","",{"$f":"IFERROR(VLOOKUP(G205,CoffeeBeans[],3,FALSE),\"\")","v":""},{"$f":"IFERROR(VLOOKUP(H205,CoffeeBeans[],3,FALSE),\"\")","v":""},{"$f":"IFERROR(VLOOKUP(G205,CoffeeBeans[],4,FALSE),\"\")","v":""},{"$f":"IFERROR(VLOOKUP(H205,CoffeeBeans[],4,FALSE),\"\")","v":""},{"$f":"IFERROR(VLOOKUP(G205,CoffeeBeans[],6,FALSE),\"\")","v":""},{"$f":"IFERROR(VLOOKUP(H205,CoffeeBeans[],6,FALSE),\"\")","v":""},{"$f":"IFERROR(VLOOKUP(G205,CoffeeBeans[],2,FALSE),\"\")","v":""},{"$f":"IFERROR(VLOOKUP(H205,CoffeeBeans[],2,FALSE),\"\")","v":""}]
["","",null,"",null,"","","",{"$f":"IFERROR(VLOOKUP(G206,CoffeeBeans[],3,FALSE),\"\")","v":""},{"$f":"IFERROR(VLOOKUP(H206,CoffeeBeans[],3,FALSE),\"\")","v":""},{"$f":"IFERROR(VLOOKUP(G206,CoffeeBeans[],4,FALSE),\"\")","v":""},{"$f":"IFERROR(VLOOKUP(H206,CoffeeBeans[],4,FALSE),\"\")","v":""},{"$f":"IFERROR(VLOOKUP(G206,CoffeeBeans[],6,FALSE),\"\")","v":""},{"$f":"IFERROR(VLOOKUP(H206,CoffeeBeans[],6,FALSE),\"\")","v":""},{"$f":"IFERROR(VLOOKUP(G206,CoffeeBeans[],2,FALSE),\"\")","v":""},{"$f":"IFERROR(VLOOKUP(H206,CoffeeBeans[],2,FALSE),\"\")","v":""}]
["","",null,"",null,"","","",{"$f":"IFERROR(VLOOKUP(G207,CoffeeBeans[],3,FALSE),\"\")","v":""},{"$f":"IFERROR(VLOOKUP(H207,CoffeeBeans[],3,FALSE),\"\")","v":""},{"$f":"IFERROR(VLOOKUP(G207,CoffeeBeans[],4,FALSE),\"\")","v":""},{"$f":"IFERROR(VLOOKUP(H207,CoffeeBeans[],4,FALSE),\"\")","v":""},{"$f":"IFERROR(VLOOKUP(G207,CoffeeBeans[],6,FALSE),\"\")","v":""},{"$f":"IFERROR(VLOOKUP(H207,CoffeeBeans[],6,FALSE),\"\")","v":""},{"$f":"IFERROR(VLOOKUP(G207,CoffeeBeans[],2,FALSE),\"\")","v":""},{"$f":"IFERROR(VLOOKUP(H207,CoffeeBeans[],2,FALSE),\"\")","v":""}]
["","",null,"",null,"","","",{"$f":"IFERROR(VLOOKUP(G208,CoffeeBeans[],3,FALSE),\"\")","v":""},{"$f":"IFERROR(VLOOKUP(H208,CoffeeBeans[],3,FALSE),\"\")","v":""},{"$f":"IFERROR(VLOOKUP(G208,CoffeeBeans[],4,FALSE),\"\")","v":""},{"$f":"IFERROR(VLOOKUP(H208,CoffeeBeans[],4,FALSE),\"\")","v":""},{"$f":"IFERROR(VLOOKUP(G208,CoffeeBeans[],6,FALSE),\"\")","v":""},{"$f":"IFERROR(VLOOKUP(H208,CoffeeBeans[],6,FALSE),\"\")","v":""},{"$f":"IFERROR(VLOOKUP(G208,CoffeeBeans[],2,FALSE),\"\")","v":""},{"$f":"IFERROR(VLOOKUP(H208,CoffeeBeans[],2,FALSE),\"\")","v":""}]
["","",null,"",null,"","","",{"$f":"IFERROR(VLOOKUP(G209,CoffeeBeans[],3,FALSE),\"\")","v":""},{"$f":"IFERROR(VLOOKUP(H209,CoffeeBeans[],3,FALSE),\"\")","v":""},{"$f":"IFERROR(VLOOKUP(G209,CoffeeBeans[],4,FALSE),\"\")","v":""},{"$f":"IFERROR(VLOOKUP(H209,CoffeeBeans[],4,FALSE),\"\")","v":""},{"$f":"IFERROR(VLOOKUP(G209,CoffeeBeans[],6,FALSE),\"\")","v":""},{"$f":"IFERROR(VLOOKUP(H209,CoffeeBeans[],6,FALSE),\"\")","v":""},{"$f":"IFERROR(VLOOKUP(G209,CoffeeBeans[],2,FALSE),\"\")","v":""},{"$f":"IFERROR(VLOOKUP(H209,CoffeeBeans[],2,FALSE),\"\")","v":""}]
["","",null,"",null,"","","",{"$f":"IFERROR(VLOOKUP(G210,CoffeeBeans[],3,FALSE),\"\")","v":""},{"$f":"IFERROR(VLOOKUP(H210,CoffeeBeans[],3,FALSE),\"\")","v":""},{"$f":"IFERROR(VLOOKUP(G210,CoffeeBeans[],4,FALSE),\"\")","v":""},{"$f":"IFERROR(VLOOKUP(H210,CoffeeBeans[],4,FALSE),\"\")","v":""},{"$f":"IFERROR(VLOOKUP(G210,CoffeeBeans[],6,FALSE),\"\")","v":""},{"$f":"IFERROR(VLOOKUP(H210,CoffeeBeans[],6,FALSE),\"\")","v":""},{"$f":"IFERROR(VLOOKUP(G210,CoffeeBeans[],2,FALSE),\"\")","v":""},{"$f":"IFERROR(VLOOKUP(H210,CoffeeBeans[],2,FALSE),\"\")","v":""}]
["","",null,"",null,"","","",{"$f":"IFERROR(VLOOKUP(G211,CoffeeBeans[],3,FALSE),\"\")","v":""},{"$f":"IFERROR(VLOOKUP(H211,CoffeeBeans[],3,FALSE),\"\")","v":""},{"$f":"IFERROR(VLOOKUP(G211,CoffeeBeans[],4,FALSE),\"\")","v":""},{"$f":"IFERROR(VLOOKUP(H211,CoffeeBeans[],4,FALSE),\"\")","v":""},{"$f":"IFERROR(VLOOKUP(G211,CoffeeBeans[],6,FALSE),\"\")","v":""},{"$f":"IFERROR(VLOOKUP(H211,CoffeeBeans[],6,FALSE),\"\")","v":""},{"$f":"IFERROR(VLOOKUP(G211,CoffeeBeans[],2,FALSE),\"\")","v":""},{"$f":"IFERROR(VLOOKUP(H211,CoffeeBeans[],2,FALSE),\"\")","v":""}]
["","",null,"",null,"","","",{"$f":"IFERROR(VLOOKUP(G212,CoffeeBeans[],3,FALSE),\"\")","v":""},{"$f":"IFERROR(VLOOKUP(H212,CoffeeBeans[],3,FALSE),\"\")","v":""},{"$f":"IFERROR(VLOOKUP(G212,CoffeeBeans[],4,FALSE),\"\")","v":""},{"$f":"IFERROR(VLOOKUP(H212,CoffeeBeans[],4,FALSE),\"\")","v":""},{"$f":"IFERROR(VLOOKUP(G212,CoffeeBeans[],6,FALSE),\"\")","v":""},{"$f":"IFERROR(VLOOKUP(H212,CoffeeBeans[],6,FALSE),\"\")","v":""},{"$f":"IFERROR(VLOOKUP(G212,CoffeeBeans[],2,FALSE),\"\")","v":""},{"$f":"IFERROR(VLOOKUP(H212,CoffeeBeans[],2,FALSE),\"\")","v":""}]
["","",null,"",null,"","","",{"$f":"IFERROR(VLOOKUP(G213,CoffeeBeans[],3,FALSE),\"\")","v":""},{"$f":"IFERROR(VLOOKUP(H213,CoffeeBeans[],3,FALSE),\"\")","v":""},{"$f":"IFERROR(VLOOKUP(G213,CoffeeBeans[],4,FALSE),\"\")","v":""},{"$f":"IFERROR(VLOOKUP(H213,CoffeeBeans[],4,FALSE),\"\")","v":""},{"$f":"IFERROR(VLOOKUP(G213,CoffeeBeans[],6,FALSE),\"\")","v":""},{"$f":"IFERROR(VLOOKUP(H213,CoffeeBeans[],6,FALSE),\"\")","v":""},{"$f":"IFERROR(VLOOKUP(G213,CoffeeBeans[],2,FALSE),\"\")","v":""},{"$f":"IFERROR(VLOOKUP(H213,CoffeeBeans[],2,FALSE),\"\")","v":""}]
["","",null,"",null,"","","",{"$f":"IFERROR(VLOOKUP(G214,CoffeeBeans[],3,FALSE),\"\")","v":""},{"$f":"IFERROR(VLOOKUP(H214,CoffeeBeans[],3,FALSE),\"\")","v":""},{"$f":"IFERROR(VLOOKUP(G214,CoffeeBeans[],4,FALSE),\"\")","v":""},{"$f":"IFERROR(VLOOKUP(H214,CoffeeBeans[],4,FALSE),\"\")","v":""},{"$f":"IFERROR(VLOOKUP(G214,CoffeeBeans[],6,FALSE),\"\")","v":""},{"$f":"IFERROR(VLOOKUP(H214,CoffeeBeans[],6,FALSE),\"\")","v":""},{"$f":"IFERROR(VLOOKUP(G214,CoffeeBeans[],2,FALSE),\"\")","v":""},{"$f":"IFERROR(VLOOKUP(H214,CoffeeBeans[],2,FALSE),\"\")","v":""}]
["","",null,"",null,"","","",{"$f":"IFERROR(VLOOKUP(G215,CoffeeBeans[],3,FALSE),\"\")","v":""},{"$f":"IFERROR(VLOOKUP(H215,CoffeeBeans[],3,FALSE),\"\")","v":""},{"$f":"IFERROR(VLOOKUP(G215,CoffeeBeans[],4,FALSE),\"\")","v":""},{"$f":"IFERROR(VLOOKUP(H215,CoffeeBeans[],4,FALSE),\"\")","v":""},{"$f":"IFERROR(VLOOKUP(G215,CoffeeBeans[],6,FALSE),\"\")","v":""},{"$f":"IFERROR(VLOOKUP(H215,CoffeeBeans[],6,FALSE),\"\")","v":""},{"$f":"IFERROR(VLOOKUP(G215,CoffeeBeans[],2,FALSE),\"\")","v":""},{"$f":"IFERROR(VLOOKUP(H215,CoffeeBeans[],2,FALSE),\"\")","v":""}]
["","",null,"",null,"","","",{"$f":"IFERROR(VLOOKUP(G216,CoffeeBeans[],3,FALSE),\"\")","v":""},{"$f":"IFERROR(VLOOKUP(H216,CoffeeBeans[],3,FALSE),\"\")","v":""},{"$f":"IFERROR(VLOOKUP(G216,CoffeeBeans[],4,FALSE),\"\")","v":""},{"$f":"IFERROR(VLOOKUP(H216,CoffeeBeans[],4,FALSE),\"\")","v":""},{"$f":"IFERROR(VLOOKUP(G216,CoffeeBeans[],6,FALSE),\"\")","v":""},{"$f":"IFERROR(VLOOKUP(H216,CoffeeBeans[],6,FALSE),\"\")","v":""},{"$f":"IFERROR(VLOOKUP(G216,CoffeeBeans[],2,FALSE),\"\")","v":""},{"$f":"IFERROR(VLOOKUP(H216,CoffeeBeans[],2,FALSE),\"\")","v":""}]
["","",null,"",null,"","","",{"$f":"IFERROR(VLOOKUP(G217,CoffeeBeans[],3,FALSE),\"\")","v":""},{"$f":"IFERROR(VLOOKUP(H217,CoffeeBeans[],3,FALSE),\"\")","v":""},{"$f":"IFERROR(VLOOKUP(G217,CoffeeBeans[],4,FALSE),\"\")","v":""},{"$f":"IFERROR(VLOOKUP(H217,CoffeeBeans[],4,FALSE),\"\")","v":""},{"$f":"IFERROR(VLOOKUP(G217,CoffeeBeans[],6,FALSE),\"\")","v":""},{"$f":"IFERROR(VLOOKUP(H217,CoffeeBeans[],6,FALSE),\"\")","v":""},{"$f":"IFERROR(VLOOKUP(G217,CoffeeBeans[],2,FALSE),\"\")","v":""},{"$f":"IFERROR(VLOOKUP(H217,CoffeeBeans[],2,FALSE),\"\")","v":""}]
["","",null,"",null,"","","",{"$f":"IFERROR(VLOOKUP(G218,CoffeeBeans[],3,FALSE),\"\")","v":""},{"$f":"IFERROR(VLOOKUP(H218,CoffeeBeans[],3,FALSE),\"\")","v":""},{"$f":"IFERROR(VLOOKUP(G218,CoffeeBeans[],4,FALSE),\"\")","v":""},{"$f":"IFERROR(VLOOKUP(H218,CoffeeBeans[],4,FALSE),\"\")","v":""},{"$f":"IFERROR(VLOOKUP(G218,CoffeeBeans[],6,FALSE),\"\")","v":""},{"$f":"IFERROR(VLOOKUP(H218,CoffeeBeans[],6,FALSE),\"\")","v":""},{"$f":"IFERROR(VLOOKUP(G218,CoffeeBeans[],2,FALSE),\"\")","v":""},{"$f":"IFERROR(VLOOKUP(H218,CoffeeBeans[],2,FALSE),\"\")","v":""}]
["","",null,"",null,"","","",{"$f":"IFERROR(VLOOKUP(G219,CoffeeBeans[],3,FALSE),\"\")","v":""},{"$f":"IFERROR(VLOOKUP(H219,CoffeeBeans[],3,FALSE),\"\")","v":""},{"$f":"IFERROR(VLOOKUP(G219,CoffeeBeans[],4,FALSE),\"\")","v":""},{"$f":"IFERROR(VLOOKUP(H219,CoffeeBeans[],4,FALSE),\"\")","v":""},{"$f":"IFERROR(VLOOKUP(G219,CoffeeBeans[],6,FALSE),\"\")","v":""},{"$f":"IFERROR(VLOOKUP(H219,CoffeeBeans[],6,FALSE),\"\")","v":""},{"$f":"IFERROR(VLOOKUP(G219,CoffeeBeans[],2,FALSE),\"\")","v":""},{"$f":"IFERROR(VLOOKUP(H219,CoffeeBeans[],2,FALSE),\"\")","v":""}]
["","",null,"",null,"","","",{"$f":"IFERROR(VLOOKUP(G220,CoffeeBeans[],3,FALSE),\"\")","v":""},{"$f":"IFERROR(VLOOKUP(H220,CoffeeBeans[],3,FALSE),\"\")","v":""},{"$f":"IFERROR(VLOOKUP(G220,CoffeeBeans[],4,FALSE),\"\")","v":""},{"$f":"IFERROR(VLOOKUP(H220,CoffeeBeans[],4,FALSE),\"\")","v":""},{"$f":"IFERROR(VLOOKUP(G220,CoffeeBeans[],6,FALSE),\"\")","v":""},{"$f":"IFERROR(VLOOKUP(H220,CoffeeBeans[],6,FALSE),\"\")","v":""},{"$f":"IFERROR(VLOOKUP(G220,CoffeeBeans[],2,FALSE),\"\")","v":""},{"$f":"IFERROR(VLOOKUP(H220,CoffeeBeans[],2,FALSE),\"\")","v":""}]
["","",null,"",null,"","","",{"$f":"IFERROR(VLOOKUP(G221,CoffeeBeans[],3,FALSE),\"\")","v":""},{"$f":"IFERROR(VLOOKUP(H221,CoffeeBeans[],3,FALSE),\"\")","v":""},{"$f":"IFERROR(VLOOKUP(G221,CoffeeBeans[],4,FALSE),\"\")","v":""},{"$f":"IFERROR(VLOOKUP(H221,CoffeeBeans[],4,FALSE),\"\")","v":""},{"$f":"IFERROR(VLOOKUP(G221,CoffeeBeans[],6,FALSE),\"\")","v":""},{"$f":"IFERROR(VLOOKUP(H221,CoffeeBeans[],6,FALSE),\"\")","v":""},{"$f":"IFERROR(VLOOKUP(G221,CoffeeBeans[],2,FALSE),\"\")","v":""},{"$f":"IFERROR(VLOOKUP(H221,CoffeeBeans[],2,FALSE),\"\")","v":""}]
["","",null,"",null,"","","",{"$f":"IFERROR(VLOOKUP(G222,CoffeeBeans[],3,FALSE),\"\")","v":""},{"$f":"IFERROR(VLOOKUP(H222,CoffeeBeans[],3,FALSE),\"\")","v":""},{"$f":"IFERROR(VLOOKUP(G222,CoffeeBeans[],4,FALSE),\"\")","v":""},{"$f":"IFERROR(VLOOKUP(H222,CoffeeBeans[],4,FALSE),\"\")","v":""},{"$f":"IFERROR(VLOOKUP(G222,CoffeeBeans[],6,FALSE),\"\")","v":""},{"$f":"IFERROR(VLOOKUP(H222,CoffeeBeans[],6,FALSE),\"\")","v":""},{"$f":"IFERROR(VLOOKUP(G222,CoffeeBeans[],2,FALSE),\"\")","v":""},{"$f":"IFERROR(VLOOKUP(H222,CoffeeBeans[],2,FALSE),\"\")","v":""}]
["","",null,"",null,"","","",{"$f":"IFERROR(VLOOKUP(G223,CoffeeBeans[],3,FALSE),\"\")","v":""},{"$f":"IFERROR(VLOOKUP(H223,CoffeeBeans[],3,FALSE),\"\")","v":""},{"$f":"IFERROR(VLOOKUP(G223,CoffeeBeans[],4,FALSE),\"\")","v":""},{"$f":"IFERROR(VLOOKUP(H223,CoffeeBeans[],4,FALSE),\"\")","v":""},{"$f":"IFERROR(VLOOKUP(G223,CoffeeBeans[],6,FALSE),\"\")","v":""},{"$f":"IFERROR(VLOOKUP(H223,CoffeeBeans[],6,FALSE),\"\")","v":""},{"$f":"IFERROR(VLOOKUP(G223,CoffeeBeans[],2,FALSE),\"\")","v":""},{"$f":"IFERROR(VLOOKUP(H223,CoffeeBeans[],2,FALSE),\"\")","v":""}]
["","",null,"",null,"","","",{"$f":"IFERROR(VLOOKUP(G224,CoffeeBeans[],3,FALSE),\"\")","v":""},{"$f":"IFERROR(VLOOKUP(H224,CoffeeBeans[],3,FALSE),\"\")","v":""},{"$f":"IFERROR(VLOOKUP(G224,CoffeeBeans[],4,FALSE),\"\")","v":""},{"$f":"IFERROR(VLOOKUP(H224,CoffeeBeans[],4,FALSE),\"\")","v":""},{"$f":"IFERROR(VLOOKUP(G224,CoffeeBeans[],6,FALSE),\"\")","v":""},{"$f":"IFERROR(VLOOKUP(H224,CoffeeBeans[],6,FALSE),\"\")","v":""},{"$f":"IFERROR(VLOOKUP(G224,CoffeeBeans[],2,FALSE),\"\")","v":""},{"$f":"IFERROR(VLOOKUP(H224,CoffeeBeans[],2,FALSE),\"\")","v":""}]
["","",null,"",null,"","","",{"$f":"IFERROR(VLOOKUP(G225,CoffeeBeans[],3,FALSE),\"\")","v":""},{"$f":"IFERROR(VLOOKUP(H225,CoffeeBeans[],3,FALSE),\"\")","v":""},{"$f":"IFERROR(VLOOKUP(G225,CoffeeBeans[],4,FALSE),\"\")","v":""},{"$f":"IFERROR(VLOOKUP(H225,CoffeeBeans[],4,FALSE),\"\")","v":""},{"$f":"IFERROR(VLOOKUP(G225,CoffeeBeans[],6,FALSE),\"\")","v":""},{"$f":"IFERROR(VLOOKUP(H225,CoffeeBeans[],6,FALSE),\"\")","v":""},{"$f":"IFERROR(VLOOKUP(G225,CoffeeBeans[],2,FALSE),\"\")","v":""},{"$f":"IFERROR(VLOOKUP(H225,CoffeeBeans[],2,FALSE),\"\")","v":""}]
["","",null,"",null,"","","",{"$f":"IFERROR(VLOOKUP(G226,CoffeeBeans[],3,FALSE),\"\")","v":""},{"$f":"IFERROR(VLOOKUP(H226,CoffeeBeans[],3,FALSE),\"\")","v":""},{"$f":"IFERROR(VLOOKUP(G226,CoffeeBeans[],4,FALSE),\"\")","v":""},{"$f":"IFERROR(VLOOKUP(H226,CoffeeBeans[],4,FALSE),\"\")","v":""},{"$f":"IFERROR(VLOOKUP(G226,CoffeeBeans[],6,FALSE),\"\")","v":""},{"$f":"IFERROR(VLOOKUP(H226,CoffeeBeans[],6,FALSE),\"\")","v":""},{"$f":"IFERROR(VLOOKUP(G226,CoffeeBeans[],2,FALSE),\"\")","v":""},{"$f":"IFERROR(VLOOKUP(H226,CoffeeBeans[],2,FALSE),\"\")","v":""}]
["","",null,"",null,"","","",{"$f":"IFERROR(VLOOKUP(G227,CoffeeBeans[],3,FALSE),\"\")","v":""},{"$f":"IFERROR(VLOOKUP(H227,CoffeeBeans[],3,FALSE),\"\")","v":""},{"$f":"IFERROR(VLOOKUP(G227,CoffeeBeans[],4,FALSE),\"\")","v":""},{"$f":"IFERROR(VLOOKUP(H227,CoffeeBeans[],4,FALSE),\"\")","v":""},{"$f":"IFERROR(VLOOKUP(G227,CoffeeBeans[],6,FALSE),\"\")","v":""},{"$f":"IFERROR(VLOOKUP(H227,CoffeeBeans[],6,FALSE),\"\")","v":""},{"$f":"IFERROR(VLOOKUP(G227,CoffeeBeans[],2,FALSE),\"\")","v":""},{"$f":"IFERROR(VLOOKUP(H227,CoffeeBeans[],2,FALSE),\"\")","v":""}]
["","",null,"",null,"","","",{"$f":"IFERROR(VLOOKUP(G228,CoffeeBeans[],3,FALSE),\"\")","v":""},{"$f":"IFERROR(VLOOKUP(H228,CoffeeBeans[],3,FALSE),\"\")","v":""},{"$f":"IFERROR(VLOOKUP(G228,CoffeeBeans[],4,FALSE),\"\")","v":""},{"$f":"IFERROR(VLOOKUP(H228,CoffeeBeans[],4,FALSE),\"\")","v":""},{"$f":"IFERROR(VLOOKUP(G228,CoffeeBeans[],6,FALSE),\"\")","v":""},{"$f":"IFERROR(VLOOKUP(H228,CoffeeBeans[],6,FALSE),\"\")","v":""},{"$f":"IFERROR(VLOOKUP(G228,CoffeeBeans[],2,FALSE),\"\")","v":""},{"$f":"IFERROR(VLOOKUP(H228,CoffeeBeans[],2,FALSE),\"\")","v":""}]
["","",null,"",null,"","","",{"$f":"IFERROR(VLOOKUP(G229,CoffeeBeans[],3,FALSE),\"\")","v":""},{"$f":"IFERROR(VLOOKUP(H229,CoffeeBeans[],3,FALSE),\"\")","v":""},{"$f":"IFERROR(VLOOKUP(G229,CoffeeBeans[],4,FALSE),\"\")","v":""},{"$f":"IFERROR(VLOOKUP(H229,CoffeeBeans[],4,FALSE),\"\")","v":""},{"$f":"IFERROR(VLOOKUP(G229,CoffeeBeans[],6,FALSE),\"\")","v":""},{"$f":"IFERROR(VLOOKUP(H229,CoffeeBeans[],6,FALSE),\"\")","v":""},{"$f":"IFERROR(VLOOKUP(G229,CoffeeBeans[],2,FALSE),\"\")","v":""},{"$f":"IFERROR(VLOOKUP(H229,CoffeeBeans[],2,FALSE),\"\")","v":""}]
["","",null,"",null,"","","",{"$f":"IFERROR(VLOOKUP(G230,CoffeeBeans[],3,FALSE),\"\")","v":""},{"$f":"IFERROR(VLOOKUP(H230,CoffeeBeans[],3,FALSE),\"\")","v":""},{"$f":"IFERROR(VLOOKUP(G230,CoffeeBeans[],4,FALSE),\"\")","v":""},{"$f":"IFERROR(VLOOKUP(H230,CoffeeBeans[],4,FALSE),\"\")","v":""},{"$f":"IFERROR(VLOOKUP(G230,CoffeeBeans[],6,FALSE),\"\")","v":""},{"$f":"IFERROR(VLOOKUP(H230,CoffeeBeans[],6,FALSE),\"\")","v":""},{"$f":"IFERROR(VLOOKUP(G230,CoffeeBeans[],2,FALSE),\"\")","v":""},{"$f":"IFERROR(VLOOKUP(H230,CoffeeBeans[],2,FALSE),\"\")","v":""}]
["","",null,"",null,"","","",{"$f":"IFERROR(VLOOKUP(G231,CoffeeBeans[],3,FALSE),\"\")","v":""},{"$f":"IFERROR(VLOOKUP(H231,CoffeeBeans[],3,FALSE),\"\")","v":""},{"$f":"IFERROR(VLOOKUP(G231,CoffeeBeans[],4,FALSE),\"\")","v":""},{"$f":"IFERROR(VLOOKUP(H231,CoffeeBeans[],4,FALSE),\"\")","v":""},{"$f":"IFERROR(VLOOKUP(G231,CoffeeBeans[],6,FALSE),\"\")","v":""},{"$f":"IFERROR(VLOOKUP(H231,CoffeeBeans[],6,FALSE),\"\")","v":""},{"$f":"IFERROR(VLOOKUP(G231,CoffeeBeans[],2,FALSE),\"\")","v":""},{"$f":"IFERROR(VLOOKUP(H231,CoffeeBeans[],2,FALSE),\"\")","v":""}]
["","",null,"",null,"","","",{"$f":"IFERROR(VLOOKUP(G232,CoffeeBeans[],3,FALSE),\"\")","v":""},{"$f":"IFERROR(VLOOKUP(H232,CoffeeBeans[],3,FALSE),\"\")","v":""},{"$f":"IFERROR(VLOOKUP(G232,CoffeeBeans[],4,FALSE),\"\")","v":""},{"$f":"IFERROR(VLOOKUP(H232,CoffeeBeans[],4,FALSE),\"\")","v":""},{"$f":"IFERROR(VLOOKUP(G232,CoffeeBeans[],6,FALSE),\"\")","v":""},{"$f":"IFERROR(VLOOKUP(H232,CoffeeBeans[],6,FALSE),\"\")","v":""},{"$f":"IFERROR(VLOOKUP(G232,CoffeeBeans[],2,FALSE),\"\")","v":""},{"$f":"IFERROR(VLOOKUP(H232,CoffeeBeans[],2,FALSE),\"\")","v":""}]
["","",null,"",null,"","","",{"$f":"IFERROR(VLOOKUP(G233,CoffeeBeans[],3,FALSE),\"\")","v":""},{"$f":"IFERROR(VLOOKUP(H233,CoffeeBeans[],3,FALSE),\"\")","v":""},{"$f":"IFERROR(VLOOKUP(G233,CoffeeBeans[],4,FALSE),\"\")","v":""},{"$f":"IFERROR(VLOOKUP(H233,CoffeeBeans[],4,FALSE),\"\")","v":""},{"$f":"IFERROR(VLOOKUP(G233,CoffeeBeans[],6,FALSE),\"\")","v":""},{"$f":"IFERROR(VLOOKUP(H233,CoffeeBeans[],6,FALSE),\"\")","v":""},{"$f":"IFERROR(VLOOKUP(G233,CoffeeBeans[],2,FALSE),\"\")","v":""},{"$f":"IFERROR(VLOOKUP(H233,CoffeeBeans[],2,FALSE),\"\")","v":""}]
["","",null,"",null,"","","",{"$f":"IFERROR(VLOOKUP(G234,CoffeeBeans[],3,FALSE),\"\")","v":""},{"$f":"IFERROR(VLOOKUP(H234,CoffeeBeans[],3,FALSE),\"\")","v":""},{"$f":"IFERROR(VLOOKUP(G234,CoffeeBeans[],4,FALSE),\"\")","v":""},{"$f":"IFERROR(VLOOKUP(H234,CoffeeBeans[],4,FALSE),\"\")","v":""},{"$f":"IFERROR(VLOOKUP(G234,CoffeeBeans[],6,FALSE),\"\")","v":""},{"$f":"IFERROR(VLOOKUP(H234,CoffeeBeans[],6,FALSE),\"\")","v":""},{"$f":"IFERROR(VLOOKUP(G234,CoffeeBeans[],2,FALSE),\"\")","v":""},{"$f":"IFERROR(VLOOKUP(H234,CoffeeBeans[],2,FALSE),\"\")","v":""}]
["","",null,"",null,"","","",{"$f":"IFERROR(VLOOKUP(G235,CoffeeBeans[],3,FALSE),\"\")","v":""},{"$f":"IFERROR(VLOOKUP(H235,CoffeeBeans[],3,FALSE),\"\")","v":""},{"$f":"IFERROR(VLOOKUP(G235,CoffeeBeans[],4,FALSE),\"\")","v":""},{"$f":"IFERROR(VLOOKUP(H235,CoffeeBeans[],4,FALSE),\"\")","v":""},{"$f":"IFERROR(VLOOKUP(G235,CoffeeBeans[],6,FALSE),\"\")","v":""},{"$f":"IFERROR(VLOOKUP(H235,CoffeeBeans[],6,FALSE),\"\")","v":""},{"$f":"IFERROR(VLOOKUP(G235,CoffeeBeans[],2,FALSE),\"\")","v":""},{"$f":"IFERROR(VLOOKUP(H235,CoffeeBeans[],2,FALSE),\"\")","v":""}]
["","",null,"",null,"","","",{"$f":"IFERROR(VLOOKUP(G236,CoffeeBeans[],3,FALSE),\"\")","v":""},{"$f":"IFERROR(VLOOKUP(H236,CoffeeBeans[],3,FALSE),\"\")","v":""},{"$f":"IFERROR(VLOOKUP(G236,CoffeeBeans[],4,FALSE),\"\")","v":""},{"$f":"IFERROR(VLOOKUP(H236,CoffeeBeans[],4,FALSE),\"\")","v":""},{"$f":"IFERROR(VLOOKUP(G236,CoffeeBeans[],6,FALSE),\"\")","v":""},{"$f":"IFERROR(VLOOKUP(H236,CoffeeBeans[],6,FALSE),\"\")","v":""},{"$f":"IFERROR(VLOOKUP(G236,CoffeeBeans[],2,FALSE),\"\")","v":""},{"$f":"IFERROR(VLOOKUP(H236,CoffeeBeans[],2,FALSE),\"\")","v":""}]
["","",null,"",null,"","","",{"$f":"IFERROR(VLOOKUP(G237,CoffeeBeans[],3,FALSE),\"\")","v":""},{"$f":"IFERROR(VLOOKUP(H237,CoffeeBeans[],3,FALSE),\"\")","v":""},{"$f":"IFERROR(VLOOKUP(G237,CoffeeBeans[],4,FALSE),\"\")","v":""},{"$f":"IFERROR(VLOOKUP(H237,CoffeeBeans[],4,FALSE),\"\")","v":""},{"$f":"IFERROR(VLOOKUP(G237,CoffeeBeans[],6,FALSE),\"\")","v":""},{"$f":"IFERROR(VLOOKUP(H237,CoffeeBeans[],6,FALSE),\"\")","v":""},{"$f":"IFERROR(VLOOKUP(G237,CoffeeBeans[],2,FALSE),\"\")","v":""},{"$f":"IFERROR(VLOOKUP(H237,CoffeeBeans[],2,FALSE),\"\")","v":""}]
["","",null,"",null,"","","",{"$f":"IFERROR(VLOOKUP(G238,CoffeeBeans[],3,FALSE),\"\")","v":""},{"$f":"IFERROR(VLOOKUP(H238,CoffeeBeans[],3,FALSE),\"\")","v":""},{"$f":"IFERROR(VLOOKUP(G238,CoffeeBeans[],4,FALSE),\"\")","v":""},{"$f":"IFERROR(VLOOKUP(H238,CoffeeBeans[],4,FALSE),\"\")","v":""},{"$f":"IFERROR(VLOOKUP(G238,CoffeeBeans[],6,FALSE),\"\")","v":""},{"$f":"IFERROR(VLOOKUP(H238,CoffeeBeans[],6,FALSE),\"\")","v":""},{"$f":"IFERROR(VLOOKUP(G238,CoffeeBeans[],2,FALSE),\"\")","v":""},{"$f":"IFERROR(VLOOKUP(H238,CoffeeBeans[],2,FALSE),\"\")","v":""}]
["","",null,"",null,"","","",{"$f":"IFERROR(VLOOKUP(G239,CoffeeBeans[],3,FALSE),\"\")","v":""},{"$f":"IFERROR(VLOOKUP(H239,CoffeeBeans[],3,FALSE),\"\")","v":""},{"$f":"IFERROR(VLOOKUP(G239,CoffeeBeans[],4,FALSE),\"\")","v":""},{"$f":"IFERROR(VLOOKUP(H239,CoffeeBeans[],4,FALSE),\"\")","v":""},{"$f":"IFERROR(VLOOKUP(G239,CoffeeBeans[],6,FALSE),\"\")","v":""},{"$f":"IFERROR(VLOOKUP(H239,CoffeeBeans[],6,FALSE),\"\")","v":""},{"$f":"IFERROR(VLOOKUP(G239,CoffeeBeans[],2,FALSE),\"\")","v":""},{"$f":"IFERROR(VLOOKUP(H239,CoffeeBeans[],2,FALSE),\"\")","v":""}]
["","",null,"",null,"","","",{"$f":"IFERROR(VLOOKUP(G240,CoffeeBeans[],3,FALSE),\"\")","v":""},{"$f":"IFERROR(VLOOKUP(H240,CoffeeBeans[],3,FALSE),\"\")","v":""},{"$f":"IFERROR(VLOOKUP(G240,CoffeeBeans[],4,FALSE),\"\")","v":""},{"$f":"IFERROR(VLOOKUP(H240,CoffeeBeans[],4,FALSE),\"\")","v":""},{"$f":"IFERROR(VLOOKUP(G240,CoffeeBeans[],6,FALSE),\"\")","v":""},{"$f":"IFERROR(VLOOKUP(H240,CoffeeBeans[],6,FALSE),\"\")","v":""},{"$f":"IFERROR(VLOOKUP(G240,CoffeeBeans[],2,FALSE),\"\")","v":""},{"$f":"IFERROR(VLOOKUP(H240,CoffeeBeans[],2,FALSE),\"\")","v":""}]
["","",null,"",null,"","","",{"$f":"IFERROR(VLOOKUP(G241,CoffeeBeans[],3,FALSE),\"\")","v":""},{"$f":"IFERROR(VLOOKUP(H241,CoffeeBeans[],3,FALSE),\"\")","v":""},{"$f":"IFERROR(VLOOKUP(G241,CoffeeBeans[],4,FALSE),\"\")","v":""},{"$f":"IFERROR(VLOOKUP(H241,CoffeeBeans[],4,FALSE),\"\")","v":""},{"$f":"IFERROR(VLOOKUP(G241,CoffeeBeans[],6,FALSE),\"\")","v":""},{"$f":"IFERROR(VLOOKUP(H241,CoffeeBeans[],6,FALSE),\"\")","v":""},{"$f":"IFERROR(VLOOKUP(G241,CoffeeBeans[],2,FALSE),\"\")","v":""},{"$f":"IFERROR(VLOOKUP(H241,CoffeeBeans[],2,FALSE),\"\")","v":""}]
["","",null,"",null,"","","",{"$f":"IFERROR(VLOOKUP(G242,CoffeeBeans[],3,FALSE),\"\")","v":""},{"$f":"IFERROR(VLOOKUP(H242,CoffeeBeans[],3,FALSE),\"\")","v":""},{"$f":"IFERROR(VLOOKUP(G242,CoffeeBeans[],4,FALSE),\"\")","v":""},{"$f":"IFERROR(VLOOKUP(H242,CoffeeBeans[],4,FALSE),\"\")","v":""},{"$f":"IFERROR(VLOOKUP(G242,CoffeeBeans[],6,FALSE),\"\")","v":""},{"$f":"IFERROR(VLOOKUP(H242,CoffeeBeans[],6,FALSE),\"\")","v":""},{"$f":"IFERROR(VLOOKUP(G242,CoffeeBeans[],2,FALSE),\"\")","v":""},{"$f":"IFERROR(VLOOKUP(H242,CoffeeBeans[],2,FALSE),\"\")","v":""}]
["","",null,"",null,null,"","",{"$f":"IFERROR(VLOOKUP(G243,CoffeeBeans[],3,FALSE),\"\")","v":""},{"$f":"IFERROR(VLOOKUP(H243,CoffeeBeans[],3,FALSE),\"\")","v":""},{"$f":"IFERROR(VLOOKUP(G243,CoffeeBeans[],4,FALSE),\"\")","v":""},{"$f":"IFERROR(VLOOKUP(H243,CoffeeBeans[],4,FALSE),\"\")","v":""},{"$f":"IFERROR(VLOOKUP(G243,CoffeeBeans[],6,FALSE),\"\")","v":""},{"$f":"IFERROR(VLOOKUP(H243,CoffeeBeans[],6,FALSE),\"\")","v":""},{"$f":"IFERROR(VLOOKUP(G243,CoffeeBeans[],2,FALSE),\"\")","v":""},{"$f":"IFERROR(VLOOKUP(H243,CoffeeBeans[],2,FALSE),\"\")","v":""}]
["","",null,"",null,null,"","",{"$f":"IFERROR(VLOOKUP(G244,CoffeeBeans[],3,FALSE),\"\")","v":""},{"$f":"IFERROR(VLOOKUP(H244,CoffeeBeans[],3,FALSE),\"\")","v":""},{"$f":"IFERROR(VLOOKUP(G244,CoffeeBeans[],4,FALSE),\"\")","v":""},{"$f":"IFERROR(VLOOKUP(H244,CoffeeBeans[],4,FALSE),\"\")","v":""},{"$f":"IFERROR(VLOOKUP(G244,CoffeeBeans[],6,FALSE),\"\")","v":""},{"$f":"IFERROR(VLOOKUP(H244,CoffeeBeans[],6,FALSE),\"\")","v":""},{"$f":"IFERROR(VLOOKUP(G244,CoffeeBeans[],2,FALSE),\"\")","v":""},{"$f":"IFERROR(VLOOKUP(H244,CoffeeBeans[],2,FALSE),\"\")","v":""}]
["","",null,"",null,null,"","",{"$f":"IFERROR(VLOOKUP(G245,CoffeeBeans[],3,FALSE),\"\")","v":""},{"$f":"IFERROR(VLOOKUP(H245,CoffeeBeans[],3,FALSE),\"\")","v":""},{"$f":"IFERROR(VLOOKUP(G245,CoffeeBeans[],4,FALSE),\"\")","v":""},{"$f":"IFERROR(VLOOKUP(H245,CoffeeBeans[],4,FALSE),\"\")","v":""},{"$f":"IFERROR(VLOOKUP(G245,CoffeeBeans[],6,FALSE),\"\")","v":""},{"$f":"IFERROR(VLOOKUP(H245,CoffeeBeans[],6,FALSE),\"\")","v":""},{"$f":"IFERROR(VLOOKUP(G245,CoffeeBeans[],2,FALSE),\"\")","v":""},{"$f":"IFERROR(VLOOKUP(H245,CoffeeBeans[],2,FALSE),\"\")","v":""}]
["","",null,"",null,null,"","",{"$f":"IFERROR(VLOOKUP(G246,CoffeeBeans[],3,FALSE),\"\")","v":""},{"$f":"IFERROR(VLOOKUP(H246,CoffeeBeans[],3,FALSE),\"\")","v":""},{"$f":"IFERROR(VLOOKUP(G246,CoffeeBeans[],4,FALSE),\"\")","v":""},{"$f":"IFERROR(VLOOKUP(H246,CoffeeBeans[],4,FALSE),\"\")","v":""},{"$f":"IFERROR(VLOOKUP(G246,CoffeeBeans[],6,FALSE),\"\")","v":""},{"$f":"IFERROR(VLOOKUP(H246,CoffeeBeans[],6,FALSE),\"\")","v":""},{"$f":"IFERROR(VLOOKUP(G246,CoffeeBeans[],2,FALSE),\"\")","v":""},{"$f":"IFERROR(VLOOKUP(H246,CoffeeBeans[],2,FALSE),\"\")","v":""}]
["","",null,"",null,null,"","",{"$f":"IFERROR(VLOOKUP(G247,CoffeeBeans[],3,FALSE),\"\")","v":""},{"$f":"IFERROR(VLOOKUP(H247,CoffeeBeans[],3,FALSE),\"\")","v":""},{"$f":"IFERROR(VLOOKUP(G247,CoffeeBeans[],4,FALSE),\"\")","v":""},{"$f":"IFERROR(VLOOKUP(H247,CoffeeBeans[],4,FALSE),\"\")","v":""},{"$f":"IFERROR(VLOOKUP(G247,CoffeeBeans[],6,FALSE),\"\")","v":""},{"$f":"IFERROR(VLOOKUP(H247,CoffeeBeans[],6,FALSE),\"\")","v":""},{"$f":"IFERROR(VLOOKUP(G247,CoffeeBeans[],2,FALSE),\"\")","v":""},{"$f":"IFERROR(VLOOKUP(H247,CoffeeBeans[],2,FALSE),\"\")","v":""}]
["","",null,"",null,null,"","",{"$f":"IFERROR(VLOOKUP(G248,CoffeeBeans[],3,FALSE),\"\")","v":""},{"$f":"IFERROR(VLOOKUP(H248,CoffeeBeans[],3,FALSE),\"\")","v":""},{"$f":"IFERROR(VLOOKUP(G248,CoffeeBeans[],4,FALSE),\"\")","v":""},{"$f":"IFERROR(VLOOKUP(H248,CoffeeBeans[],4,FALSE),\"\")","v":""},{"$f":"IFERROR(VLOOKUP(G248,CoffeeBeans[],6,FALSE),\"\")","v":""},{"$f":"IFERROR(VLOOKUP(H248,CoffeeBeans[],6,FALSE),\"\")","v":""},{"$f":"IFERROR(VLOOKUP(G248,CoffeeBeans[],2,FALSE),\"\")","v":""},{"$f":"IFERROR(VLOOKUP(H248,CoffeeBeans[],2,FALSE),\"\")","v":""}]
["","",null,"",null,null,"","",{"$f":"IFERROR(VLOOKUP(G249,CoffeeBeans[],3,FALSE),\"\")","v":""},{"$f":"IFERROR(VLOOKUP(H249,CoffeeBeans[],3,FALSE),\"\")","v":""},{"$f":"IFERROR(VLOOKUP(G249,CoffeeBeans[],4,FALSE),\"\")","v":""},{"$f":"IFERROR(VLOOKUP(H249,CoffeeBeans[],4,FALSE),\"\")","v":""},{"$f":"IFERROR(VLOOKUP(G249,CoffeeBeans[],6,FALSE),\"\")","v":""},{"$f":"IFERROR(VLOOKUP(H249,CoffeeBeans[],6,FALSE),\"\")","v":""},{"$f":"IFERROR(VLOOKUP(G249,CoffeeBeans[],2,FALSE),\"\")","v":""},{"$f":"IFERROR(VLOOKUP(H249,CoffeeBeans[],2,FALSE),\"\")","v":""}]
["","",null,"",null,null,"","",{"$f":"IFERROR(VLOOKUP(G250,CoffeeBeans[],3,FALSE),\"\")","v":""},{"$f":"IFERROR(VLOOKUP(H250,CoffeeBeans[],3,FALSE),\"\")","v":""},{"$f":"IFERROR(VLOOKUP(G250,CoffeeBeans[],4,FALSE),\"\")","v":""},{"$f":"IFERROR(VLOOKUP(H250,CoffeeBeans[],4,FALSE),\"\")","v":""},{"$f":"IFERROR(VLOOKUP(G250,CoffeeBeans[],6,FALSE),\"\")","v":""},{"$f":"IFERROR(VLOOKUP(H250,CoffeeBeans[],6,FALSE),\"\")","v":""},{"$f":"IFERROR(VLOOKUP(G250,CoffeeBeans[],2,FALSE),\"\")","v":""},{"$f":"IFERROR(VLOOKUP(H250,CoffeeBeans[],2,FALSE),\"\")","v":""}]
["","",null,"",null,null,"","",{"$f":"IFERROR(VLOOKUP(G251,CoffeeBeans[],3,FALSE),\"\")","v":""},{"$f":"IFERROR(VLOOKUP(H251,CoffeeBeans[],3,FALSE),\"\")","v":""},{"$f":"IFERROR(VLOOKUP(G251,CoffeeBeans[],4,FALSE),\"\")","v":""},{"$f":"IFERROR(VLOOKUP(H251,CoffeeBeans[],4,FALSE),\"\")","v":""},{"$f":"IFERROR(VLOOKUP(G251,CoffeeBeans[],6,FALSE),\"\")","v":""},{"$f":"IFERROR(VLOOKUP(H251,CoffeeBeans[],6,FALSE),\"\")","v":""},{"$f":"IFERROR(VLOOKUP(G251,CoffeeBeans[],2,FALSE),\"\")","v":""},{"$f":"IFERROR(VLOOKUP(H251,CoffeeBeans[],2,FALSE),\"\")","v":""}]
["","",null,"",null,null,"","",{"$f":"IFERROR(VLOOKUP(G252,CoffeeBeans[],3,FALSE),\"\")","v":""},{"$f":"IFERROR(VLOOKUP(H252,CoffeeBeans[],3,FALSE),\"\")","v":""},{"$f":"IFERROR(VLOOKUP(G252,CoffeeBeans[],4,FALSE),\"\")","v":""},{"$f":"IFERROR(VLOOKUP(H252,CoffeeBeans[],4,FALSE),\"\")","v":""},{"$f":"IFERROR(VLOOKUP(G252,CoffeeBeans[],6,FALSE),\"\")","v":""},{"$f":"IFERROR(VLOOKUP(H252,CoffeeBeans[],6,FALSE),\"\")","v":""},{"$f":"IFERROR(VLOOKUP(G252,CoffeeBeans[],2,FALSE),\"\")","v":""},{"$f":"IFERROR(VLOOKUP(H252,CoffeeBeans[],2,FALSE),\"\")","v":""}]
["","",null,"",null,null,"","",{"$f":"IFERROR(VLOOKUP(G253,CoffeeBeans[],3,FALSE),\"\")","v":""},{"$f":"IFERROR(VLOOKUP(H253,CoffeeBeans[],3,FALSE),\"\")","v":""},{"$f":"IFERROR(VLOOKUP(G253,CoffeeBeans[],4,FALSE),\"\")","v":""},{"$f":"IFERROR(VLOOKUP(H253,CoffeeBeans[],4,FALSE),\"\")","v":""},{"$f":"IFERROR(VLOOKUP(G253,CoffeeBeans[],6,FALSE),\"\")","v":""},{"$f":"IFERROR(VLOOKUP(H253,CoffeeBeans[],6,FALSE),\"\")","v":""},{"$f":"IFERROR(VLOOKUP(G253,CoffeeBeans[],2,FALSE),\"\")","v":""},{"$f":"IFERROR(VLOOKUP(H253,CoffeeBeans[],2,FALSE),\"\")","v":""}]
["","",null,"",null,null,"","",{"$f":"IFERROR(VLOOKUP(G254,CoffeeBeans[],3,FALSE),\"\")","v":""},{"$f":"IFERROR(VLOOKUP(H254,CoffeeBeans[],3,FALSE),\"\")","v":""},{"$f":"IFERROR(VLOOKUP(G254,CoffeeBeans[],4,FALSE),\"\")","v":""},{"$f":"IFERROR(VLOOKUP(H254,CoffeeBeans[],4,FALSE),\"\")","v":""},{"$f":"IFERROR(VLOOKUP(G254,CoffeeBeans[],6,FALSE),\"\")","v":""},{"$f":"IFERROR(VLOOKUP(H254,CoffeeBeans[],6,FALSE),\"\")","v":""},{"$f":"IFERROR(VLOOKUP(G254,CoffeeBeans[],2,FALSE),\"\")","v":""},{"$f":"IFERROR(VLOOKUP(H254,CoffeeBeans[],2,FALSE),\"\")","v":""}]
["","",null,"",null,null,"","",{"$f":"IFERROR(VLOOKUP(G255,CoffeeBeans[],3,FALSE),\"\")","v":""},{"$f":"IFERROR(VLOOKUP(H255,CoffeeBeans[],3,FALSE),\"\")","v":""},{"$f":"IFERROR(VLOOKUP(G255,CoffeeBeans[],4,FALSE),\"\")","v":""},{"$f":"IFERROR(VLOOKUP(H255,CoffeeBeans[],4,FALSE),\"\")","v":""},{"$f":"IFERROR(VLOOKUP(G255,CoffeeBeans[],6,FALSE),\"\")","v":""},{"$f":"IFERROR(VLOOKUP(H255,CoffeeBeans[],6,FALSE),\"\")","v":""},{"$f":"IFERROR(VLOOKUP(G255,CoffeeBeans[],2,FALSE),\"\")","v":""},{"$f":"IFERROR(VLOOKUP(H255,CoffeeBeans[],2,FALSE),\"\")","v":""}]
["","",null,"",null,null,"","",{"$f":"IFERROR(VLOOKUP(G256,CoffeeBeans[],3,FALSE),\"\")","v":""},{"$f":"IFERROR(VLOOKUP(H256,CoffeeBeans[],3,FALSE),\"\")","v":""},{"$f":"IFERROR(VLOOKUP(G256,CoffeeBeans[],4,FALSE),\"\")","v":""},{"$f":"IFERROR(VLOOKUP(H256,CoffeeBeans[],4,FALSE),\"\")","v":""},{"$f":"IFERROR(VLOOKUP(G256,CoffeeBeans[],6,FALSE),\"\")","v":""},{"$f":"IFERROR(VLOOKUP(H256,CoffeeBeans[],6,FALSE),\"\")","v":""},{"$f":"IFERROR(VLOOKUP(G256,CoffeeBeans[],2,FALSE),\"\")","v":""},{"$f":"IFERROR(VLOOKUP(H256,CoffeeBeans[],2,FALSE),\"\")","v":""}]
["","",null,"",null,null,"","",{"$f":"IFERROR(VLOOKUP(G257,CoffeeBeans[],3,FALSE),\"\")","v":""},{"$f":"IFERROR(VLOOKUP(H257,CoffeeBeans[],3,FALSE),\"\")","v":""},{"$f":"IFERROR(VLOOKUP(G257,CoffeeBeans[],4,FALSE),\"\")","v":""},{"$f":"IFERROR(VLOOKUP(H257,CoffeeBeans[],4,FALSE),\"\")","v":""},{"$f":"IFERROR(VLOOKUP(G257,CoffeeBeans[],6,FALSE),\"\")","v":""},{"$f":"IFERROR(VLOOKUP(H257,CoffeeBeans[],6,FALSE),\"\")","v":""},{"$f":"IFERROR(VLOOKUP(G257,CoffeeBeans[],2,FALSE),\"\")","v":""},{"$f":"IFERROR(VLOOKUP(H257,CoffeeBeans[],2,FALSE),\"\")","v":""}]
["","",null,{"$f":"IF(ISNUMBER(A258),COUNTIF(G:G,C258)+COUNTIF(H:H,C258),\"\")","v":""},null,null,{"$f":"IF(ISNUMBER(F258),VLOOKUP(F258,Participants2,2,FALSE),\"\")","v":""},{"$f":"IF(ISNUMBER(F258),VLOOKUP($E$3+1-F258,Participants2,2,FALSE),\"\")","v":""},{"$f":"IFERROR(VLOOKUP(G258,CoffeeBeans[],3,FALSE),\"\")","v":""},{"$f":"IFERROR(VLOOKUP(H258,CoffeeBeans[],3,FALSE),\"\")","v":""},{"$f":"IFERROR(VLOOKUP(G258,CoffeeBeans[],4,FALSE),\"\")","v":""},{"$f":"IFERROR(VLOOKUP(H258,CoffeeBeans[],4,FALSE),\"\")","v":""},{"$f":"IFERROR(VLOOKUP(G258,CoffeeBeans[],6,FALSE),\"\")","v":""},{"$f":"IFERROR(VLOOKUP(H258,CoffeeBeans[],6,FALSE),\"\")","v":""},{"$f":"IFERROR(VLOOKUP(G258,CoffeeBeans[],2,FALSE),\"\")","v":""},{"$f":"IFERROR(VLOOKUP(H258,CoffeeBeans[],2,FALSE),\"\")","v":""}]
[{"$f":"IF(ISBLANK(C259),\"\",RAND())","v":""},{"$f":"IFERROR(_xlfn.RANK.AVG(A259,$A$2:$A$1001,0),\"\")","v":""},null,"",null,null,"","",{"$f":"IFERROR(VLOOKUP(G259,CoffeeBeans[],3,FALSE),\"\")","v":""},{"$f":"IFERROR(VLOOKUP(H259,CoffeeBeans[],3,FALSE),\"\")","v":""},{"$f":"IFERROR(VLOOKUP(G259,CoffeeBeans[],4,FALSE),\"\")","v":""},{"$f":"IFERROR(VLOOKUP(H259,CoffeeBeans[],4,FALSE),\"\")","v":""},{"$f":"IFERROR(VLOOKUP(G259,CoffeeBeans[],6,FALSE),\"\")","v":""},{"$f":"IFERROR(VLOOKUP(H259,CoffeeBeans[],6,FALSE),\"\")","v":""},{"$f":"IFERROR(VLOOKUP(G259,CoffeeBeans[],2,FALSE),\"\")","v":""},{"$f":"IFERROR(VLOOKUP(H259,CoffeeBeans[],2,FALSE),\"\")","v":""}]
["","",null,"",null,null,"","",{"$f":"IFERROR(VLOOKUP(G260,CoffeeBeans[],3,FALSE),\"\")","v":""},{"$f":"IFERROR(VLOOKUP(H260,CoffeeBeans[],3,FALSE),\"\")","v":""},{"$f":"IFERROR(VLOOKUP(G260,CoffeeBeans[],4,FALSE),\"\")","v":""},{"$f":"IFERROR(VLOOKUP(H260,CoffeeBeans[],4,FALSE),\"\")","v":""},{"$f":"IFERROR(VLOOKUP(G260,CoffeeBeans[],6,FALSE),\"\")","v":""},{"$f":"IFERROR(VLOOKUP(H260,CoffeeBeans[],6,FALSE),\"\")","v":""},{"$f":"IFERROR(VLOOKUP(G260,CoffeeBeans[],2,FALSE),\"\")","v":""},{"$f":"IFERROR(VLOOKUP(H260,CoffeeBeans[],2,FALSE),\"\")","v":""}]
["","",null,"",null,null,"","",{"$f":"IFERROR(VLOOKUP(G261,CoffeeBeans[],3,FALSE),\"\")","v":""},{"$f":"IFERROR(VLOOKUP(H261,CoffeeBeans[],3,FALSE),\"\")","v":""},{"$f":"IFERROR(VLOOKUP(G261,CoffeeBeans[],4,FALSE),\"\")","v":""},{"$f":"IFERROR(VLOOKUP(H261,CoffeeBeans[],4,FALSE),\"\")","v":""},{"$f":"IFERROR(VLOOKUP(G261,CoffeeBeans[],6,FALSE),\"\")","v":""},{"$f":"IFERROR(VLOOKUP(H261,CoffeeBeans[],6,FALSE),\"\")","v":""},{"$f":"IFERROR(VLOOKUP(G261,CoffeeBeans[],2,FALSE),\"\")","v":""},{"$f":"IFERROR(VLOOKUP(H261,CoffeeBeans[],2,FALSE),\"\")","v":""}]
["","",null,"",null,null,"","",{"$f":"IFERROR(VLOOKUP(G262,CoffeeBeans[],3,FALSE),\"\")","v":""},{"$f":"IFERROR(VLOOKUP(H262,CoffeeBeans[],3,FALSE),\"\")","v":""},{"$f":"IFERROR(VLOOKUP(G262,CoffeeBeans[],4,FALSE),\"\")","v":""},{"$f":"IFERROR(VLOOKUP(H262,CoffeeBeans[],4,FALSE),\"\")","v":""},{"$f":"IFERROR(VLOOKUP(G262,CoffeeBeans[],6,FALSE),\"\")","v":""},{"$f":"IFERROR(VLOOKUP(H262,CoffeeBeans[],6,FALSE),\"\")","v":""},{"$f":"IFERROR(VLOOKUP(G262,CoffeeBeans[],2,FALSE),\"\")","v":""},{"$f":"IFERROR(VLOOKUP(H262,CoffeeBeans[],2,FALSE),\"\")","v":""}]
["","",null,"",null,null,"","",{"$f":"IFERROR(VLOOKUP(G263,CoffeeBeans[],3,FALSE),\"\")","v":""},{"$f":"IFERROR(VLOOKUP(H263,CoffeeBeans[],3,FALSE),\"\")","v":""},{"$f":"IFERROR(VLOOKUP(G263,CoffeeBeans[],4,FALSE),\"\")","v":""},{"$f":"IFERROR(VLOOKUP(H263,CoffeeBeans[],4,FALSE),\"\")","v":""},{"$f":"IFERROR(VLOOKUP(G263,CoffeeBeans[],6,FALSE),\"\")","v":""},{"$f":"IFERROR(VLOOKUP(H263,CoffeeBeans[],6,FALSE),\"\")","v":""},{"$f":"IFERROR(VLOOKUP(G263,CoffeeBeans[],2,FALSE),\"\")","v":""},{"$f":"IFERROR(VLOOKUP(H263,CoffeeBeans[],2,FALSE),\"\")","v":""}]
["","",null,"",null,null,"","",{"$f":"IFERROR(VLOOKUP(G264,CoffeeBeans[],3,FALSE),\"\")","v":""},{"$f":"IFERROR(VLOOKUP(H264,CoffeeBeans[],3,FALSE),\"\")","v":""},{"$f":"IFERROR(VLOOKUP(G264,CoffeeBeans[],4,FALSE),\"\")","v":""},{"$f":"IFERROR(VLOOKUP(H264,CoffeeBeans[],4,FALSE),\"\")","v":""},{"$f":"IFERROR(VLOOKUP(G264,CoffeeBeans[],6,FALSE),\"\")","v":""},{"$f":"IFERROR(VLOOKUP(H264,CoffeeBeans[],6,FALSE),\"\")","v":""},{"$f":"IFERROR(VLOOKUP(G264,CoffeeBeans[],2,FALSE),\"\")","v":""},{"$f":"IFERROR(VLOOKUP(H264,CoffeeBeans[],2,FALSE),\"\")","v":""}]
["","",null,"",null,null,"","",{"$f":"IFERROR(VLOOKUP(G265,CoffeeBeans[],3,FALSE),\"\")","v":""},{"$f":"IFERROR(VLOOKUP(H265,CoffeeBeans[],3,FALSE),\"\")","v":""},{"$f":"IFERROR(VLOOKUP(G265,CoffeeBeans[],4,FALSE),\"\")","v":""},{"$f":"IFERROR(VLOOKUP(H265,CoffeeBeans[],4,FALSE),\"\")","v":""},{"$f":"IFERROR(VLOOKUP(G265,CoffeeBeans[],6,FALSE),\"\")","v":""},{"$f":"IFERROR(VLOOKUP(H265,CoffeeBeans[],6,FALSE),\"\")","v":""},{"$f":"IFERROR(VLOOKUP(G265,CoffeeBeans[],2,FALSE),\"\")","v":""},{"$f":"IFERROR(VLOOKUP(H265,CoffeeBeans[],2,FALSE),\"\")","v":""}]
["","",null,"",null,null,"","",{"$f":"IFERROR(VLOOKUP(G266,CoffeeBeans[],3,FALSE),\"\")","v":""},{"$f":"IFERROR(VLOOKUP(H266,CoffeeBeans[],3,FALSE),\"\")","v":""},{"$f":"IFERROR(VLOOKUP(G266,CoffeeBeans[],4,FALSE),\"\")","v":""},{"$f":"IFERROR(VLOOKUP(H266,CoffeeBeans[],4,FALSE),\"\")","v":""},{"$f":"IFERROR(VLOOKUP(G266,CoffeeBeans[],6,FALSE),\"\")","v":""},{"$f":"IFERROR(VLOOKUP(H266,CoffeeBeans[],6,FALSE),\"\")","v":""},{"$f":"IFERROR(VLOOKUP(G266,CoffeeBeans[],2,FALSE),\"\")","v":""},{"$f":"IFERROR(VLOOKUP(H266,CoffeeBeans[],2,FALSE),\"\")","v":""}]
["","",null,"",null,null,"","",{"$f":"IFERROR(VLOOKUP(G267,CoffeeBeans[],3,FALSE),\"\")","v":""},{"$f":"IFERROR(VLOOKUP(H267,CoffeeBeans[],3,FALSE),\"\")","v":""},{"$f":"IFERROR(VLOOKUP(G267,CoffeeBeans[],4,FALSE),\"\")","v":""},{"$f":"IFERROR(VLOOKUP(H267,CoffeeBeans[],4,FALSE),\"\")","v":""},{"$f":"IFERROR(VLOOKUP(G267,CoffeeBeans[],6,FALSE),\"\")","v":""},{"$f":"IFERROR(VLOOKUP(H267,CoffeeBeans[],6,FALSE),\"\")","v":""},{"$f":"IFERROR(VLOOKUP(G267,CoffeeBeans[],2,FALSE),\"\")","v":""},{"$f":"IFERROR(VLOOKUP(H267,CoffeeBeans[],2,FALSE),\"\")","v":""}]
["","",null,"",null,null,"","",{"$f":"IFERROR(VLOOKUP(G268,CoffeeBeans[],3,FALSE),\"\")","v":""},{"$f":"IFERROR(VLOOKUP(H268,CoffeeBeans[],3,FALSE),\"\")","v":""},{"$f":"IFERROR(VLOOKUP(G268,CoffeeBeans[],4,FALSE),\"\")","v":""},{"$f":"IFERROR(VLOOKUP(H268,CoffeeBeans[],4,FALSE),\"\")","v":""},{"$f":"IFERROR(VLOOKUP(G268,CoffeeBeans[],6,FALSE),\"\")","v":""},{"$f":"IFERROR(VLOOKUP(H268,CoffeeBeans[],6,FALSE),\"\")","v":""},{"$f":"IFERROR(VLOOKUP(G268,CoffeeBeans[],2,FALSE),\"\")","v":""},{"$f":"IFERROR(VLOOKUP(H268,CoffeeBeans[],2,FALSE),\"\")","v":""}]
["","",null,"",null,null,"","",{"$f":"IFERROR(VLOOKUP(G269,CoffeeBeans[],3,FALSE),\"\")","v":""},{"$f":"IFERROR(VLOOKUP(H269,CoffeeBeans[],3,FALSE),\"\")","v":""},{"$f":"IFERROR(VLOOKUP(G269,CoffeeBeans[],4,FALSE),\"\")","v":""},{"$f":"IFERROR(VLOOKUP(H269,CoffeeBeans[],4,FALSE),\"\")","v":""},{"$f":"IFERROR(VLOOKUP(G269,CoffeeBeans[],6,FALSE),\"\")","v":""},{"$f":"IFERROR(VLOOKUP(H269,CoffeeBeans[],6,FALSE),\"\")","v":""},{"$f":"IFERROR(VLOOKUP(G269,CoffeeBeans[],2,FALSE),\"\")","v":""},{"$f":"IFERROR(VLOOKUP(H269,CoffeeBeans[],2,FALSE),\"\")","v":""}]
["","",null,"",null,null,"","",{"$f":"IFERROR(VLOOKUP(G270,CoffeeBeans[],3,FALSE),\"\")","v":""},{"$f":"IFERROR(VLOOKUP(H270,CoffeeBeans[],3,FALSE),\"\")","v":""},{"$f":"IFERROR(VLOOKUP(G270,CoffeeBeans[],4,FALSE),\"\")","v":""},{"$f":"IFERROR(VLOOKUP(H270,CoffeeBeans[],4,FALSE),\"\")","v":""},{"$f":"IFERROR(VLOOKUP(G270,CoffeeBeans[],6,FALSE),\"\")","v":""},{"$f":"IFERROR(VLOOKUP(H270,CoffeeBeans[],6,FALSE),\"\")","v":""},{"$f":"IFERROR(VLOOKUP(G270,CoffeeBeans[],2,FALSE),\"\")","v":""},{"$f":"IFERROR(VLOOKUP(H270,CoffeeBeans[],2,FALSE),\"\")","v":""}]
["","",null,"",null,null,"","",{"$f":"IFERROR(VLOOKUP(G271,CoffeeBeans[],3,FALSE),\"\")","v":""},{"$f":"IFERROR(VLOOKUP(H271,CoffeeBeans[],3,FALSE),\"\")","v":""},{"$f":"IFERROR(VLOOKUP(G271,CoffeeBeans[],4,FALSE),\"\")","v":""},{"$f":"IFERROR(VLOOKUP(H271,CoffeeBeans[],4,FALSE),\"\")","v":""},{"$f":"IFERROR(VLOOKUP(G271,CoffeeBeans[],6,FALSE),\"\")","v":""},{"$f":"IFERROR(VLOOKUP(H271,CoffeeBeans[],6,FALSE),\"\")","v":""},{"$f":"IFERROR(VLOOKUP(G271,CoffeeBeans[],2,FALSE),\"\")","v":""},{"$f":"IFERROR(VLOOKUP(H271,CoffeeBeans[],2,FALSE),\"\")","v":""}]
["","",null,"",null,null,"","",{"$f":"IFERROR(VLOOKUP(G272,CoffeeBeans[],3,FALSE),\"\")","v":""},{"$f":"IFERROR(VLOOKUP(H272,CoffeeBeans[],3,FALSE),\"\")","v":""},{"$f":"IFERROR(VLOOKUP(G272,CoffeeBeans[],4,FALSE),\"\")","v":""},{"$f":"IFERROR(VLOOKUP(H272,CoffeeBeans[],4,FALSE),\"\")","v":""},{"$f":"IFERROR(VLOOKUP(G272,CoffeeBeans[],6,FALSE),\"\")","v":""},{"$f":"IFERROR(VLOOKUP(H272,CoffeeBeans[],6,FALSE),\"\")","v":""},{"$f":"IFERROR(VLOOKUP(G272,CoffeeBeans[],2,FALSE),\"\")","v":""},{"$f":"IFERROR(VLOOKUP(H272,CoffeeBeans[],2,FALSE),\"\")","v":""}]
["","",null,"",null,null,"","",{"$f":"IFERROR(VLOOKUP(G273,CoffeeBeans[],3,FALSE),\"\")","v":""},{"$f":"IFERROR(VLOOKUP(H273,CoffeeBeans[],3,FALSE),\"\")","v":""},{"$f":"IFERROR(VLOOKUP(G273,CoffeeBeans[],4,FALSE),\"\")","v":""},{"$f":"IFERROR(VLOOKUP(H273,CoffeeBeans[],4,FALSE),\"\")","v":""},{"$f":"IFERROR(VLOOKUP(G273,CoffeeBeans[],6,FALSE),\"\")","v":""},{"$f":"IFERROR(VLOOKUP(H273,CoffeeBeans[],6,FALSE),\"\")","v":""},{"$f":"IFERROR(VLOOKUP(G273,CoffeeBeans[],2,FALSE),\"\")","v":""},{"$f":"IFERROR(VLOOKUP(H273,CoffeeBeans[],2,FALSE),\"\")","v":""}]
["","",null,"",null,null,"","",{"$f":"IFERROR(VLOOKUP(G274,CoffeeBeans[],3,FALSE),\"\")","v":""},{"$f":"IFERROR(VLOOKUP(H274,CoffeeBeans[],3,FALSE),\"\")","v":""},{"$f":"IFERROR(VLOOKUP(G274,CoffeeBeans[],4,FALSE),\"\")","v":""},{"$f":"IFERROR(VLOOKUP(H274,CoffeeBeans[],4,FALSE),\"\")","v":""},{"$f":"IFERROR(VLOOKUP(G274,CoffeeBeans[],6,FALSE),\"\")","v":""},{"$f":"IFERROR(VLOOKUP(H274,CoffeeBeans[],6,FALSE),\"\")","v":""},{"$f":"IFERROR(VLOOKUP(G274,CoffeeBeans[],2,FALSE),\"\")","v":""},{"$f":"IFERROR(VLOOKUP(H274,CoffeeBeans[],2,FALSE),\"\")","v":""}]
["","",null,"",null,null,"","",{"$f":"IFERROR(VLOOKUP(G275,CoffeeBeans[],3,FALSE),\"\")","v":""},{"$f":"IFERROR(VLOOKUP(H275,CoffeeBeans[],3,FALSE),\"\")","v":""},{"$f":"IFERROR(VLOOKUP(G275,CoffeeBeans[],4,FALSE),\"\")","v":""},{"$f":"IFERROR(VLOOKUP(H275,CoffeeBeans[],4,FALSE),\"\")","v":""},{"$f":"IFERROR(VLOOKUP(G275,CoffeeBeans[],6,FALSE),\"\")","v":""},{"$f":"IFERROR(VLOOKUP(H275,CoffeeBeans[],6,FALSE),\"\")","v":""},{"$f":"IFERROR(VLOOKUP(G275,CoffeeBeans[],2,FALSE),\"\")","v":""},{"$f":"IFERROR(VLOOKUP(H275,CoffeeBeans[],2,FALSE),\"\")","v":""}]
["","",null,"",null,null,"","",{"$f":"IFERROR(VLOOKUP(G276,CoffeeBeans[],3,FALSE),\"\")","v":""},{"$f":"IFERROR(VLOOKUP(H276,CoffeeBeans[],3,FALSE),\"\")","v":""},{"$f":"IFERROR(VLOOKUP(G276,CoffeeBeans[],4,FALSE),\"\")","v":""},{"$f":"IFERROR(VLOOKUP(H276,CoffeeBeans[],4,FALSE),\"\")","v":""},{"$f":"IFERROR(VLOOKUP(G276,CoffeeBeans[],6,FALSE),\"\")","v":""},{"$f":"IFERROR(VLOOKUP(H276,CoffeeBeans[],6,FALSE),\"\")","v":""},{"$f":"IFERROR(VLOOKUP(G276,CoffeeBeans[],2,FALSE),\"\")","v":""},{"$f":"IFERROR(VLOOKUP(H276,CoffeeBeans[],2,FALSE),\"\")","v":""}]
["","",null,"",null,null,"","",{"$f":"IFERROR(VLOOKUP(G277,CoffeeBeans[],3,FALSE),\"\")","v":""},{"$f":"IFERROR(VLOOKUP(H277,CoffeeBeans[],3,FALSE),\"\")","v":""},{"$f":"IFERROR(VLOOKUP(G277,CoffeeBeans[],4,FALSE),\"\")","v":""},{"$f":"IFERROR(VLOOKUP(H277,CoffeeBeans[],4,FALSE),\"\")","v":""},{"$f":"IFERROR(VLOOKUP(G277,CoffeeBeans[],6,FALSE),\"\")","v":""},{"$f":"IFERROR(VLOOKUP(H277,CoffeeBeans[],6,FALSE),\"\")","v":""},{"$f":"IFERROR(VLOOKUP(G277,CoffeeBeans[],2,FALSE),\"\")","v":""},{"$f":"IFERROR(VLOOKUP(H277,CoffeeBeans[],2,FALSE),\"\")","v":""}]
["","",null,"",null,null,"","",{"$f":"IFERROR(VLOOKUP(G278,CoffeeBeans[],3,FALSE),\"\")","v":""},{"$f":"IFERROR(VLOOKUP(H278,CoffeeBeans[],3,FALSE),\"\")","v":""},{"$f":"IFERROR(VLOOKUP(G278,CoffeeBeans[],4,FALSE),\"\")","v":""},{"$f":"IFERROR(VLOOKUP(H278,CoffeeBeans[],4,FALSE),\"\")","v":""},{"$f":"IFERROR(VLOOKUP(G278,CoffeeBeans[],6,FALSE),\"\")","v":""},{"$f":"IFERROR(VLOOKUP(H278,CoffeeBeans[],6,FALSE),\"\")","v":""},{"$f":"IFERROR(VLOOKUP(G278,CoffeeBeans[],2,FALSE),\"\")","v":""},{"$f":"IFERROR(VLOOKUP(H278,CoffeeBeans[],2,FALSE),\"\")","v":""}]
["","",null,"",null,null,"","",{"$f":"IFERROR(VLOOKUP(G279,CoffeeBeans[],3,FALSE),\"\")","v":""},{"$f":"IFERROR(VLOOKUP(H279,CoffeeBeans[],3,FALSE),\"\")","v":""},{"$f":"IFERROR(VLOOKUP(G279,CoffeeBeans[],4,FALSE),\"\")","v":""},{"$f":"IFERROR(VLOOKUP(H279,CoffeeBeans[],4,FALSE),\"\")","v":""},{"$f":"IFERROR(VLOOKUP(G279,CoffeeBeans[],6,FALSE),\"\")","v":""},{"$f":"IFERROR(VLOOKUP(H279,CoffeeBeans[],6,FALSE),\"\")","v":""},{"$f":"IFERROR(VLOOKUP(G279,CoffeeBeans[],2,FALSE),\"\")","v":""},{"$f":"IFERROR(VLOOKUP(H279,CoffeeBeans[],2,FALSE),\"\")","v":""}]
["","",null,"",null,null,"","",{"$f":"IFERROR(VLOOKUP(G280,CoffeeBeans[],3,FALSE),\"\")","v":""},{"$f":"IFERROR(VLOOKUP(H280,CoffeeBeans[],3,FALSE),\"\")","v":""},{"$f":"IFERROR(VLOOKUP(G280,CoffeeBeans[],4,FALSE),\"\")","v":""},{"$f":"IFERROR(VLOOKUP(H280,CoffeeBeans[],4,FALSE),\"\")","v":""},{"$f":"IFERROR(VLOOKUP(G280,CoffeeBeans[],6,FALSE),\"\")","v":""},{"$f":"IFERROR(VLOOKUP(H280,CoffeeBeans[],6,FALSE),\"\")","v":""},{"$f":"IFERROR(VLOOKUP(G280,CoffeeBeans[],2,FALSE),\"\")","v":""},{"$f":"IFERROR(VLOOKUP(H280,CoffeeBeans[],2,FALSE),\"\")","v":""}]
["","",null,"",null,null,"","",{"$f":"IFERROR(VLOOKUP(G281,CoffeeBeans[],3,FALSE),\"\")","v":""},{"$f":"IFERROR(VLOOKUP(H281,CoffeeBeans[],3,FALSE),\"\")","v":""},{"$f":"IFERROR(VLOOKUP(G281,CoffeeBeans[],4,FALSE),\"\")","v":""},{"$f":"IFERROR(VLOOKUP(H281,CoffeeBeans[],4,FALSE),\"\")","v":""},{"$f":"IFERROR(VLOOKUP(G281,CoffeeBeans[],6,FALSE),\"\")","v":""},{"$f":"IFERROR(VLOOKUP(H281,CoffeeBeans[],6,FALSE),\"\")","v":""},{"$f":"IFERROR(VLOOKUP(G281,CoffeeBeans[],2,FALSE),\"\")","v":""},{"$f":"IFERROR(VLOOKUP(H281,CoffeeBeans[],2,FALSE),\"\")","v":""}]
["","",null,"",null,null,"","",{"$f":"IFERROR(VLOOKUP(G282,CoffeeBeans[],3,FALSE),\"\")","v":""},{"$f":"IFERROR(VLOOKUP(H282,CoffeeBeans[],3,FALSE),\"\")","v":""},{"$f":"IFERROR(VLOOKUP(G282,CoffeeBeans[],4,FALSE),\"\")","v":""},{"$f":"IFERROR(VLOOKUP(H282,CoffeeBeans[],4,FALSE),\"\")","v":""},{"$f":"IFERROR(VLOOKUP(G282,CoffeeBeans[],6,FALSE),\"\")","v":""},{"$f":"IFERROR(VLOOKUP(H282,CoffeeBeans[],6,FALSE),\"\")","v":""},{"$f":"IFERROR(VLOOKUP(G282,CoffeeBeans[],2,FALSE),\"\")","v":""},{"$f":"IFERROR(VLOOKUP(H282,CoffeeBeans[],2,FALSE),\"\")","v":""}]
["","",null,"",null,null,"","",{"$f":"IFERROR(VLOOKUP(G283,CoffeeBeans[],3,FALSE),\"\")","v":""},{"$f":"IFERROR(VLOOKUP(H283,CoffeeBeans[],3,FALSE),\"\")","v":""},{"$f":"IFERROR(VLOOKUP(G283,CoffeeBeans[],4,FALSE),\"\")","v":""},{"$f":"IFERROR(VLOOKUP(H283,CoffeeBeans[],4,FALSE),\"\")","v":""},{"$f":"IFERROR(VLOOKUP(G283,CoffeeBeans[],6,FALSE),\"\")","v":""},{"$f":"IFERROR(VLOOKUP(H283,CoffeeBeans[],6,FALSE),\"\")","v":""},{"$f":"IFERROR(VLOOKUP(G283,CoffeeBeans[],2,FALSE),\"\")","v":""},{"$f":"IFERROR(VLOOKUP(H283,CoffeeBeans[],2,FALSE),\"\")","v":""}]
["","",null,"",null,null,"","",{"$f":"IFERROR(VLOOKUP(G284,CoffeeBeans[],3,FALSE),\"\")","v":""},{"$f":"IFERROR(VLOOKUP(H284,CoffeeBeans[],3,FALSE),\"\")","v":""},{"$f":"IFERROR(VLOOKUP(G284,CoffeeBeans[],4,FALSE),\"\")","v":""},{"$f":"IFERROR(VLOOKUP(H284,CoffeeBeans[],4,FALSE),\"\")","v":""},{"$f":"IFERROR(VLOOKUP(G284,CoffeeBeans[],6,FALSE),\"\")","v":""},{"$f":"IFERROR(VLOOKUP(H284,CoffeeBeans[],6,FALSE),\"\")","v":""},{"$f":"IFERROR(VLOOKUP(G284,CoffeeBeans[],2,FALSE),\"\")","v":""},{"$f":"IFERROR(VLOOKUP(H284,CoffeeBeans[],2,FALSE),\"\")","v":""}]
["","",null,"",null,null,"","",{"$f":"IFERROR(VLOOKUP(G285,CoffeeBeans[],3,FALSE),\"\")","v":""},{"$f":"IFERROR(VLOOKUP(H285,CoffeeBeans[],3,FALSE),\"\")","v":""},{"$f":"IFERROR(VLOOKUP(G285,CoffeeBeans[],4,FALSE),\"\")","v":""},{"$f":"IFERROR(VLOOKUP(H285,CoffeeBeans[],4,FALSE),\"\")","v":""},{"$f":"IFERROR(VLOOKUP(G285,CoffeeBeans[],6,FALSE),\"\")","v":""},{"$f":"IFERROR(VLOOKUP(H285,CoffeeBeans[],6,FALSE),\"\")","v":""},{"$f":"IFERROR(VLOOKUP(G285,CoffeeBeans[],2,FALSE),\"\")","v":""},{"$f":"IFERROR(VLOOKUP(H285,CoffeeBeans[],2,FALSE),\"\")","v":""}]
["","",null,"",null,null,"","",{"$f":"IFERROR(VLOOKUP(G286,CoffeeBeans[],3,FALSE),\"\")","v":""},{"$f":"IFERROR(VLOOKUP(H286,CoffeeBeans[],3,FALSE),\"\")","v":""},{"$f":"IFERROR(VLOOKUP(G286,CoffeeBeans[],4,FALSE),\"\")","v":""},{"$f":"IFERROR(VLOOKUP(H286,CoffeeBeans[],4,FALSE),\"\")","v":""},{"$f":"IFERROR(VLOOKUP(G286,CoffeeBeans[],6,FALSE),\"\")","v":""},{"$f":"IFERROR(VLOOKUP(H286,CoffeeBeans[],6,FALSE),\"\")","v":""},{"$f":"IFERROR(VLOOKUP(G286,CoffeeBeans[],2,FALSE),\"\")","v":""},{"$f":"IFERROR(VLOOKUP(H286,CoffeeBeans[],2,FALSE),\"\")","v":""}]
["","",null,"",null,null,"","",{"$f":"IFERROR(VLOOKUP(G287,CoffeeBeans[],3,FALSE),\"\")","v":""},{"$f":"IFERROR(VLOOKUP(H287,CoffeeBeans[],3,FALSE),\"\")","v":""},{"$f":"IFERROR(VLOOKUP(G287,CoffeeBeans[],4,FALSE),\"\")","v":""},{"$f":"IFERROR(VLOOKUP(H287,CoffeeBeans[],4,FALSE),\"\")","v":""},{"$f":"IFERROR(VLOOKUP(G287,CoffeeBeans[],6,FALSE),\"\")","v":""},{"$f":"IFERROR(VLOOKUP(H287,CoffeeBeans[],6,FALSE),\"\")","v":""},{"$f":"IFERROR(VLOOKUP(G287,CoffeeBeans[],2,FALSE),\"\")","v":""},{"$f":"IFERROR(VLOOKUP(H287,CoffeeBeans[],2,FALSE),\"\")","v":""}]
["","",null,"",null,null,"","",{"$f":"IFERROR(VLOOKUP(G288,CoffeeBeans[],3,FALSE),\"\")","v":""},{"$f":"IFERROR(VLOOKUP(H288,CoffeeBeans[],3,FALSE),\"\")","v":""},{"$f":"IFERROR(VLOOKUP(G288,CoffeeBeans[],4,FALSE),\"\")","v":""},{"$f":"IFERROR(VLOOKUP(H288,CoffeeBeans[],4,FALSE),\"\")","v":""},{"$f":"IFERROR(VLOOKUP(G288,CoffeeBeans[],6,FALSE),\"\")","v":""},{"$f":"IFERROR(VLOOKUP(H288,CoffeeBeans[],6,FALSE),\"\")","v":""},{"$f":"IFERROR(VLOOKUP(G288,CoffeeBeans[],2,FALSE),\"\")","v":""},{"$f":"IFERROR(VLOOKUP(H288,CoffeeBeans[],2,FALSE),\"\")","v":""}]
["","",null,"",null,null,"","",{"$f":"IFERROR(VLOOKUP(G289,CoffeeBeans[],3,FALSE),\"\")","v":""},{"$f":"IFERROR(VLOOKUP(H289,CoffeeBeans[],3,FALSE),\"\")","v":""},{"$f":"IFERROR(VLOOKUP(G289,CoffeeBeans[],4,FALSE),\"\")","v":""},{"$f":"IFERROR(VLOOKUP(H289,CoffeeBeans[],4,FALSE),\"\")","v":""},{"$f":"IFERROR(VLOOKUP(G289,CoffeeBeans[],6,FALSE),\"\")","v":""},{"$f":"IFERROR(VLOOKUP(H289,CoffeeBeans[],6,FALSE),\"\")","v":""},{"$f":"IFERROR(VLOOKUP(G289,CoffeeBeans[],2,FALSE),\"\")","v":""},{"$f":"IFERROR(VLOOKUP(H289,CoffeeBeans[],2,FALSE),\"\")","v":""}]
["","",null,"",null,null,"","",{"$f":"IFERROR(VLOOKUP(G290,CoffeeBeans[],3,FALSE),\"\")","v":""},{"$f":"IFERROR(VLOOKUP(H290,CoffeeBeans[],3,FALSE),\"\")","v":""},{"$f":"IFERROR(VLOOKUP(G290,CoffeeBeans[],4,FALSE),\"\")","v":""},{"$f":"IFERROR(VLOOKUP(H290,CoffeeBeans[],4,FALSE),\"\")","v":""},{"$f":"IFERROR(VLOOKUP(G290,CoffeeBeans[],6,FALSE),\"\")","v":""},{"$f":"IFERROR(VLOOKUP(H290,CoffeeBeans[],6,FALSE),\"\")","v":""},{"$f":"IFERROR(VLOOKUP(G290,CoffeeBeans[],2,FALSE),\"\")","v":""},{"$f":"IFERROR(VLOOKUP(H290,CoffeeBeans[],2,FALSE),\"\")","v":""}]
["","",null,"",null,null,"","",{"$f":"IFERROR(VLOOKUP(G291,CoffeeBeans[],3,FALSE),\"\")","v":""},{"$f":"IFERROR(VLOOKUP(H291,CoffeeBeans[],3,FALSE),\"\")","v":""},{"$f":"IFERROR(VLOOKUP(G291,CoffeeBeans[],4,FALSE),\"\")","v":""},{"$f":"IFERROR(VLOOKUP(H291,CoffeeBeans[],4,FALSE),\"\")","v":""},{"$f":"IFERROR(VLOOKUP(G291,CoffeeBeans[],6,FALSE),\"\")","v":""},{"$f":"IFERROR(VLOOKUP(H291,CoffeeBeans[],6,FALSE),\"\")","v":""},{"$f":"IFERROR(VLOOKUP(G291,CoffeeBeans[],2,FALSE),\"\")","v":""},{"$f":"IFERROR(VLOOKUP(H291,CoffeeBeans[],2,FALSE),\"\")","v":""}]
["","",null,"",null,null,"","",{"$f":"IFERROR(VLOOKUP(G292,CoffeeBeans[],3,FALSE),\"\")","v":""},{"$f":"IFERROR(VLOOKUP(H292,CoffeeBeans[],3,FALSE),\"\")","v":""},{"$f":"IFERROR(VLOOKUP(G292,CoffeeBeans[],4,FALSE),\"\")","v":""},{"$f":"IFERROR(VLOOKUP(H292,CoffeeBeans[],4,FALSE),\"\")","v":""},{"$f":"IFERROR(VLOOKUP(G292,CoffeeBeans[],6,FALSE),\"\")","v":""},{"$f":"IFERROR(VLOOKUP(H292,CoffeeBeans[],6,FALSE),\"\")","v":""},{"$f":"IFERROR(VLOOKUP(G292,CoffeeBeans[],2,FALSE),\"\")","v":""},{"$f":"IFERROR(VLOOKUP(H292,CoffeeBeans[],2,FALSE),\"\")","v":""}]
["","",null,"",null,null,"","",{"$f":"IFERROR(VLOOKUP(G293,CoffeeBeans[],3,FALSE),\"\")","v":""},{"$f":"IFERROR(VLOOKUP(H293,CoffeeBeans[],3,FALSE),\"\")","v":""},{"$f":"IFERROR(VLOOKUP(G293,CoffeeBeans[],4,FALSE),\"\")","v":""},{"$f":"IFERROR(VLOOKUP(H293,CoffeeBeans[],4,FALSE),\"\")","v":""},{"$f":"IFERROR(VLOOKUP(G293,CoffeeBeans[],6,FALSE),\"\")","v":""},{"$f":"IFERROR(VLOOKUP(H293,CoffeeBeans[],6,FALSE),\"\")","v":""},{"$f":"IFERROR(VLOOKUP(G293,CoffeeBeans[],2,FALSE),\"\")","v":""},{"$f":"IFERROR(VLOOKUP(H293,CoffeeBeans[],2,FALSE),\"\")","v":""}]
["","",null,"",null,null,"","",{"$f":"IFERROR(VLOOKUP(G294,CoffeeBeans[],3,FALSE),\"\")","v":""},{"$f":"IFERROR(VLOOKUP(H294,CoffeeBeans[],3,FALSE),\"\")","v":""},{"$f":"IFERROR(VLOOKUP(G294,CoffeeBeans[],4,FALSE),\"\")","v":""},{"$f":"IFERROR(VLOOKUP(H294,CoffeeBeans[],4,FALSE),\"\")","v":""},{"$f":"IFERROR(VLOOKUP(G294,CoffeeBeans[],6,FALSE),\"\")","v":""},{"$f":"IFERROR(VLOOKUP(H294,CoffeeBeans[],6,FALSE),\"\")","v":""},{"$f":"IFERROR(VLOOKUP(G294,CoffeeBeans[],2,FALSE),\"\")","v":""},{"$f":"IFERROR(VLOOKUP(H294,CoffeeBeans[],2,FALSE),\"\")","v":""}]
["","",null,"",null,null,"","",{"$f":"IFERROR(VLOOKUP(G295,CoffeeBeans[],3,FALSE),\"\")","v":""},{"$f":"IFERROR(VLOOKUP(H295,CoffeeBeans[],3,FALSE),\"\")","v":""},{"$f":"IFERROR(VLOOKUP(G295,CoffeeBeans[],4,FALSE),\"\")","v":""},{"$f":"IFERROR(VLOOKUP(H295,CoffeeBeans[],4,FALSE),\"\")","v":""},{"$f":"IFERROR(VLOOKUP(G295,CoffeeBeans[],6,FALSE),\"\")","v":""},{"$f":"IFERROR(VLOOKUP(H295,CoffeeBeans[],6,FALSE),\"\")","v":""},{"$f":"IFERROR(VLOOKUP(G295,CoffeeBeans[],2,FALSE),\"\")","v":""},{"$f":"IFERROR(VLOOKUP(H295,CoffeeBeans[],2,FALSE),\"\")","v":""}]
["","",null,"",null,null,"","",{"$f":"IFERROR(VLOOKUP(G296,CoffeeBeans[],3,FALSE),\"\")","v":""},{"$f":"IFERROR(VLOOKUP(H296,CoffeeBeans[],3,FALSE),\"\")","v":""},{"$f":"IFERROR(VLOOKUP(G296,CoffeeBeans[],4,FALSE),\"\")","v":""},{"$f":"IFERROR(VLOOKUP(H296,CoffeeBeans[],4,FALSE),\"\")","v":""},{"$f":"IFERROR(VLOOKUP(G296,CoffeeBeans[],6,FALSE),\"\")","v":""},{"$f":"IFERROR(VLOOKUP(H296,CoffeeBeans[],6,FALSE),\"\")","v":""},{"$f":"IFERROR(VLOOKUP(G296,CoffeeBeans[],2,FALSE),\"\")","v":""},{"$f":"IFERROR(VLOOKUP(H296,CoffeeBeans[],2,FALSE),\"\")","v":""}]
["","",null,"",null,null,"","",{"$f":"IFERROR(VLOOKUP(G297,CoffeeBeans[],3,FALSE),\"\")","v":""},{"$f":"IFERROR(VLOOKUP(H297,CoffeeBeans[],3,FALSE),\"\")","v":""},{"$f":"IFERROR(VLOOKUP(G297,CoffeeBeans[],4,FALSE),\"\")","v":""},{"$f":"IFERROR(VLOOKUP(H297,CoffeeBeans[],4,FALSE),\"\")","v":""},{"$f":"IFERROR(VLOOKUP(G297,CoffeeBeans[],6,FALSE),\"\")","v":""},{"$f":"IFERROR(VLOOKUP(H297,CoffeeBeans[],6,FALSE),\"\")","v":""},{"$f":"IFERROR(VLOOKUP(G297,CoffeeBeans[],2,FALSE),\"\")","v":""},{"$f":"IFERROR(VLOOKUP(H297,CoffeeBeans[],2,FALSE),\"\")","v":""}]
["","",null,"",null,null,"","",{"$f":"IFERROR(VLOOKUP(G298,CoffeeBeans[],3,FALSE),\"\")","v":""},{"$f":"IFERROR(VLOOKUP(H298,CoffeeBeans[],3,FALSE),\"\")","v":""},{"$f":"IFERROR(VLOOKUP(G298,CoffeeBeans[],4,FALSE),\"\")","v":""},{"$f":"IFERROR(VLOOKUP(H298,CoffeeBeans[],4,FALSE),\"\")","v":""},{"$f":"IFERROR(VLOOKUP(G298,CoffeeBeans[],6,FALSE),\"\")","v":""},{"$f":"IFERROR(VLOOKUP(H298,CoffeeBeans[],6,FALSE),\"\")","v":""},{"$f":"IFERROR(VLOOKUP(G298,CoffeeBeans[],2,FALSE),\"\")","v":""},{"$f":"IFERROR(VLOOKUP(H298,CoffeeBeans[],2,FALSE),\"\")","v":""}]
["","",null,"",null,null,"","",{"$f":"IFERROR(VLOOKUP(G299,CoffeeBeans[],3,FALSE),\"\")","v":""},{"$f":"IFERROR(VLOOKUP(H299,CoffeeBeans[],3,FALSE),\"\")","v":""},{"$f":"IFERROR(VLOOKUP(G299,CoffeeBeans[],4,FALSE),\"\")","v":""},{"$f":"IFERROR(VLOOKUP(H299,CoffeeBeans[],4,FALSE),\"\")","v":""},{"$f":"IFERROR(VLOOKUP(G299,CoffeeBeans[],6,FALSE),\"\")","v":""},{"$f":"IFERROR(VLOOKUP(H299,CoffeeBeans[],6,FALSE),\"\")","v":""},{"$f":"IFERROR(VLOOKUP(G299,CoffeeBeans[],2,FALSE),\"\")","v":""},{"$f":"IFERROR(VLOOKUP(H299,CoffeeBeans[],2,FALSE),\"\")","v":""}]
["","",null,"",null,null,"","",{"$f":"IFERROR(VLOOKUP(G300,CoffeeBeans[],3,FALSE),\"\")","v":""},{"$f":"IFERROR(VLOOKUP(H300,CoffeeBeans[],3,FALSE),\"\")","v":""},{"$f":"IFERROR(VLOOKUP(G300,CoffeeBeans[],4,FALSE),\"\")","v":""},{"$f":"IFERROR(VLOOKUP(H300,CoffeeBeans[],4,FALSE),\"\")","v":""},{"$f":"IFERROR(VLOOKUP(G300,CoffeeBeans[],6,FALSE),\"\")","v":""},{"$f":"IFERROR(VLOOKUP(H300,CoffeeBeans[],6,FALSE),\"\")","v":""},{"$f":"IFERROR(VLOOKUP(G300,CoffeeBeans[],2,FALSE),\"\")","v":""},{"$f":"IFERROR(VLOOKUP(H300,CoffeeBeans[],2,FALSE),\"\")","v":""}]
["","",null,"",null,null,"","",{"$f":"IFERROR(VLOOKUP(G301,CoffeeBeans[],3,FALSE),\"\")","v":""},{"$f":"IFERROR(VLOOKUP(H301,CoffeeBeans[],3,FALSE),\"\")","v":""},{"$f":"IFERROR(VLOOKUP(G301,CoffeeBeans[],4,FALSE),\"\")","v":""},{"$f":"IFERROR(VLOOKUP(H301,CoffeeBeans[],4,FALSE),\"\")","v":""},{"$f":"IFERROR(VLOOKUP(G301,CoffeeBeans[],6,FALSE),\"\")","v":""},{"$f":"IFERROR(VLOOKUP(H301,CoffeeBeans[],6,FALSE),\"\")","v":""},{"$f":"IFERROR(VLOOKUP(G301,CoffeeBeans[],2,FALSE),\"\")","v":""},{"$f":"IFERROR(VLOOKUP(H301,CoffeeBeans[],2,FALSE),\"\")","v":""}]
["","",null,"",null,null,"","",{"$f":"IFERROR(VLOOKUP(G302,CoffeeBeans[],3,FALSE),\"\")","v":""},{"$f":"IFERROR(VLOOKUP(H302,CoffeeBeans[],3,FALSE),\"\")","v":""},{"$f":"IFERROR(VLOOKUP(G302,CoffeeBeans[],4,FALSE),\"\")","v":""},{"$f":"IFERROR(VLOOKUP(H302,CoffeeBeans[],4,FALSE),\"\")","v":""},{"$f":"IFERROR(VLOOKUP(G302,CoffeeBeans[],6,FALSE),\"\")","v":""},{"$f":"IFERROR(VLOOKUP(H302,CoffeeBeans[],6,FALSE),\"\")","v":""},{"$f":"IFERROR(VLOOKUP(G302,CoffeeBeans[],2,FALSE),\"\")","v":""},{"$f":"IFERROR(VLOOKUP(H302,CoffeeBeans[],2,FALSE),\"\")","v":""}]
["","",null,""]

{"sheet":"Matched Names","index":2,"n_rows":0,"n_cols":0,"rows_kept":0,"cut":false,"hidden":false,"merged":[]}